BDBM50194972 1-((6-(2-(5-methyl-2-phenyloxazol-4-yl)ethoxy)pyridin-3-yl)methyl)cyclopropanecarboxylic acid::CHEMBL219005
SMILES: Cc1oc(nc1CCOc1ccc(CC2(CC2)C(O)=O)cn1)-c1ccccc1
InChI Key: InChIKey=AFJDPZQOARQRHU-UHFFFAOYSA-N
Data: 1 KI  2 EC50
Activity Spreadsheet -- Enzyme Inhibition Constant Data from BindingDB
Found 3 hits for monomerid = 50194972
Trg + Lig
Ki
nM
ΔG°
kcal/mole
IC50
nM
Kd
nM
EC50/IC50
nM
koff
s-1
kon
M-1s-1
pHTemp
°C
Peroxisome proliferator-activated receptor
(Homo sapiens (Human))
BDBM50194972
(1-((6-(2-(5-methyl-2-phenyloxazol-4-yl)ethoxy)pyri...)
Show SMILES Cc1oc(nc1CCOc1ccc(CC2(CC2)C(O)=O)cn1)-c1ccccc1
Show InChI InChI=1S/C22H22N2O4/c1-15-18(24-20(28-15)17-5-3-2-4-6-17)9-12-27-19-8-7-16(14-23-19)13-22(10-11-22)21(25)26/h2-8,14H,9-13H2,1H3,(H,25,26)
NCI pathway
Reactome pathway
7.98E+3n/an/an/an/an/an/an/an/a
Pfizer Global R&D
Curated by ChEMBL
Assay Description
Displacement of radiolabeled darglitazone from human PPAR gamma by SPA binding assay
Bioorg Med Chem Lett 16: 6120-3 (2006)
Article DOI: 10.1016/j.bmcl.2006.08.110
BindingDB Entry DOI: 10.7270/Q20Z72XV
Peroxisome proliferator-activated receptor alpha (PPAR alpha)
(Homo sapiens (Human))
BDBM50194972
(1-((6-(2-(5-methyl-2-phenyloxazol-4-yl)ethoxy)pyri...)
Show SMILES Cc1oc(nc1CCOc1ccc(CC2(CC2)C(O)=O)cn1)-c1ccccc1
Show InChI InChI=1S/C22H22N2O4/c1-15-18(24-20(28-15)17-5-3-2-4-6-17)9-12-27-19-8-7-16(14-23-19)13-22(10-11-22)21(25)26/h2-8,14H,9-13H2,1H3,(H,25,26)
n/an/an/an/a 6.15E+3n/an/an/an/a
Pfizer Global R&D
Curated by ChEMBL
Assay Description
Agonist activity at human PPAR alpha in a HepG2 cells by PPAR-GAL4 transactivation assay
Bioorg Med Chem Lett 16: 6120-3 (2006)
Article DOI: 10.1016/j.bmcl.2006.08.110
BindingDB Entry DOI: 10.7270/Q20Z72XV
Peroxisome proliferator-activated receptor
(Homo sapiens (Human))
BDBM50194972
(1-((6-(2-(5-methyl-2-phenyloxazol-4-yl)ethoxy)pyri...)
Show SMILES Cc1oc(nc1CCOc1ccc(CC2(CC2)C(O)=O)cn1)-c1ccccc1
Show InChI InChI=1S/C22H22N2O4/c1-15-18(24-20(28-15)17-5-3-2-4-6-17)9-12-27-19-8-7-16(14-23-19)13-22(10-11-22)21(25)26/h2-8,14H,9-13H2,1H3,(H,25,26)
NCI pathway
Reactome pathway
n/an/an/an/a 1.01E+3n/an/an/an/a
Pfizer Global R&D
Curated by ChEMBL
Assay Description
Agonist activity at human PPAR gamma in a HepG2 cells by PPAR-GAL4 transactivation assay
Bioorg Med Chem Lett 16: 6120-3 (2006)
Article DOI: 10.1016/j.bmcl.2006.08.110
BindingDB Entry DOI: 10.7270/Q20Z72XV