BDBM50195297 1-piperidin-1-yl-cyclopropanecarboxylic acid (5-hydroxy-adamantan-2-yl)-amide::CHEMBL221159
SMILES: O[C@@]12C[C@H]3CC(C1)[C@@H](NC(=O)C1(CC1)N1CCCCC1)C(C3)C2
InChI Key: InChIKey=CEZQNMXBDYZVET-VWOQGHHKSA-N
Data: 2 KI  3 IC50
Activity Spreadsheet -- Enzyme Inhibition Constant Data from BindingDB
Found 5 hits for monomerid = 50195297
Trg + Lig
Ki
nM
ΔG°
kcal/mole
IC50
nM
Kd
nM
EC50/IC50
nM
koff
s-1
kon
M-1s-1
pHTemp
°C
11-beta-hydroxysteroid dehydrogenase 1
(Homo sapiens (Human))
BDBM50195297
(1-piperidin-1-yl-cyclopropanecarboxylic acid (5-hy...)
Show SMILES O[C@@]12C[C@H]3CC(C1)[C@@H](NC(=O)C1(CC1)N1CCCCC1)C(C3)C2 |wU:7.8,3.2,1.0,TLB:6:1:21:5.4.7,8:7:2.1.6:4,THB:0:1:21:5.4.7,0:1:4:21.20.7,22:1:4:21.20.7,22:20:2.1.6:4,(2.65,-13.05,;2.78,-11.53,;1.25,-11.83,;2.54,-10.65,;2.65,-9.17,;4.03,-8.8,;2.9,-9.94,;5.37,-9.48,;6.72,-8.73,;8.04,-9.52,;8.02,-11.06,;9.38,-8.77,;10.17,-7.44,;8.63,-7.42,;10.71,-9.56,;10.68,-11.1,;11.99,-11.88,;13.34,-11.14,;13.37,-9.6,;12.04,-8.8,;5.24,-11,;3.83,-11.24,;4.14,-12.2,)|
Show InChI InChI=1S/C19H30N2O2/c22-17(19(4-5-19)21-6-2-1-3-7-21)20-16-14-8-13-9-15(16)12-18(23,10-13)11-14/h13-16,23H,1-12H2,(H,20,22)/t13-,14?,15?,16+,18-
Reactome pathway
6n/an/an/an/an/an/an/an/a
Abbott Laboratories
Curated by ChEMBL
Assay Description
Inhibition of human truncated 11beta-HSD1 assessed as inhibition of radiolabeled cortisone to cortisol conversion by SPA
Bioorg Med Chem Lett 16: 5958-62 (2006)
Article DOI: 10.1016/j.bmcl.2006.08.129
BindingDB Entry DOI: 10.7270/Q23R0SJT
11-beta-hydroxysteroid dehydrogenase 1
(Mus musculus (mouse))
BDBM50195297
(1-piperidin-1-yl-cyclopropanecarboxylic acid (5-hy...)
Show SMILES O[C@@]12C[C@H]3CC(C1)[C@@H](NC(=O)C1(CC1)N1CCCCC1)C(C3)C2 |wU:7.8,3.2,1.0,TLB:6:1:21:5.4.7,8:7:2.1.6:4,THB:0:1:21:5.4.7,0:1:4:21.20.7,22:1:4:21.20.7,22:20:2.1.6:4,(2.65,-13.05,;2.78,-11.53,;1.25,-11.83,;2.54,-10.65,;2.65,-9.17,;4.03,-8.8,;2.9,-9.94,;5.37,-9.48,;6.72,-8.73,;8.04,-9.52,;8.02,-11.06,;9.38,-8.77,;10.17,-7.44,;8.63,-7.42,;10.71,-9.56,;10.68,-11.1,;11.99,-11.88,;13.34,-11.14,;13.37,-9.6,;12.04,-8.8,;5.24,-11,;3.83,-11.24,;4.14,-12.2,)|
Show InChI InChI=1S/C19H30N2O2/c22-17(19(4-5-19)21-6-2-1-3-7-21)20-16-14-8-13-9-15(16)12-18(23,10-13)11-14/h13-16,23H,1-12H2,(H,20,22)/t13-,14?,15?,16+,18-
Reactome pathway
58n/an/an/an/an/an/an/an/a
Abbott Laboratories
Curated by ChEMBL
Assay Description
Inhibition of mouse truncated 11beta-HSD1 assessed as inhibition of radiolabeled cortisone to cortisol conversion by SPA
Bioorg Med Chem Lett 16: 5958-62 (2006)
Article DOI: 10.1016/j.bmcl.2006.08.129
BindingDB Entry DOI: 10.7270/Q23R0SJT
11-beta-hydroxysteroid dehydrogenase 1
(Homo sapiens (Human))
BDBM50195297
(1-piperidin-1-yl-cyclopropanecarboxylic acid (5-hy...)
Show SMILES O[C@@]12C[C@H]3CC(C1)[C@@H](NC(=O)C1(CC1)N1CCCCC1)C(C3)C2 |wU:7.8,3.2,1.0,TLB:6:1:21:5.4.7,8:7:2.1.6:4,THB:0:1:21:5.4.7,0:1:4:21.20.7,22:1:4:21.20.7,22:20:2.1.6:4,(2.65,-13.05,;2.78,-11.53,;1.25,-11.83,;2.54,-10.65,;2.65,-9.17,;4.03,-8.8,;2.9,-9.94,;5.37,-9.48,;6.72,-8.73,;8.04,-9.52,;8.02,-11.06,;9.38,-8.77,;10.17,-7.44,;8.63,-7.42,;10.71,-9.56,;10.68,-11.1,;11.99,-11.88,;13.34,-11.14,;13.37,-9.6,;12.04,-8.8,;5.24,-11,;3.83,-11.24,;4.14,-12.2,)|
Show InChI InChI=1S/C19H30N2O2/c22-17(19(4-5-19)21-6-2-1-3-7-21)20-16-14-8-13-9-15(16)12-18(23,10-13)11-14/h13-16,23H,1-12H2,(H,20,22)/t13-,14?,15?,16+,18-
Reactome pathway
n/an/a 390n/an/an/an/an/an/a
Abbott Laboratories
Curated by ChEMBL
Assay Description
Inhibition of human 11beta-HSD1 expressed in HEK293 cells assessed as inhibition of cortisol formation by fluorescent polarization immunoassay
Bioorg Med Chem Lett 16: 5958-62 (2006)
Article DOI: 10.1016/j.bmcl.2006.08.129
BindingDB Entry DOI: 10.7270/Q23R0SJT
11-beta-hydroxysteroid dehydrogenase 2
(Homo sapiens (Human))
BDBM50195297
(1-piperidin-1-yl-cyclopropanecarboxylic acid (5-hy...)
Show SMILES O[C@@]12C[C@H]3CC(C1)[C@@H](NC(=O)C1(CC1)N1CCCCC1)C(C3)C2 |wU:7.8,3.2,1.0,TLB:6:1:21:5.4.7,8:7:2.1.6:4,THB:0:1:21:5.4.7,0:1:4:21.20.7,22:1:4:21.20.7,22:20:2.1.6:4,(2.65,-13.05,;2.78,-11.53,;1.25,-11.83,;2.54,-10.65,;2.65,-9.17,;4.03,-8.8,;2.9,-9.94,;5.37,-9.48,;6.72,-8.73,;8.04,-9.52,;8.02,-11.06,;9.38,-8.77,;10.17,-7.44,;8.63,-7.42,;10.71,-9.56,;10.68,-11.1,;11.99,-11.88,;13.34,-11.14,;13.37,-9.6,;12.04,-8.8,;5.24,-11,;3.83,-11.24,;4.14,-12.2,)|
Show InChI InChI=1S/C19H30N2O2/c22-17(19(4-5-19)21-6-2-1-3-7-21)20-16-14-8-13-9-15(16)12-18(23,10-13)11-14/h13-16,23H,1-12H2,(H,20,22)/t13-,14?,15?,16+,18-
n/an/a>1.00E+5n/an/an/an/an/an/a
Abbott Laboratories
Curated by ChEMBL
Assay Description
Inhibition of human 11beta-HSD2 assessed as cortisol disappearance by SPA
Bioorg Med Chem Lett 16: 5958-62 (2006)
Article DOI: 10.1016/j.bmcl.2006.08.129
BindingDB Entry DOI: 10.7270/Q23R0SJT
11-beta-Hydroxysteroid Dehydrogenase 2 (11-beta-HSD2)
(Mus musculus (mouse))
BDBM50195297
(1-piperidin-1-yl-cyclopropanecarboxylic acid (5-hy...)
Show SMILES O[C@@]12C[C@H]3CC(C1)[C@@H](NC(=O)C1(CC1)N1CCCCC1)C(C3)C2 |wU:7.8,3.2,1.0,TLB:6:1:21:5.4.7,8:7:2.1.6:4,THB:0:1:21:5.4.7,0:1:4:21.20.7,22:1:4:21.20.7,22:20:2.1.6:4,(2.65,-13.05,;2.78,-11.53,;1.25,-11.83,;2.54,-10.65,;2.65,-9.17,;4.03,-8.8,;2.9,-9.94,;5.37,-9.48,;6.72,-8.73,;8.04,-9.52,;8.02,-11.06,;9.38,-8.77,;10.17,-7.44,;8.63,-7.42,;10.71,-9.56,;10.68,-11.1,;11.99,-11.88,;13.34,-11.14,;13.37,-9.6,;12.04,-8.8,;5.24,-11,;3.83,-11.24,;4.14,-12.2,)|
Show InChI InChI=1S/C19H30N2O2/c22-17(19(4-5-19)21-6-2-1-3-7-21)20-16-14-8-13-9-15(16)12-18(23,10-13)11-14/h13-16,23H,1-12H2,(H,20,22)/t13-,14?,15?,16+,18-
n/an/a>1.00E+5n/an/an/an/an/an/a
Abbott Laboratories
Curated by ChEMBL
Assay Description
Inhibition of mouse 11beta-HSD2 assessed as cortisol disappearance by SPA
Bioorg Med Chem Lett 16: 5958-62 (2006)
Article DOI: 10.1016/j.bmcl.2006.08.129
BindingDB Entry DOI: 10.7270/Q23R0SJT