BDBM50195479 CHEMBL3950376
SMILES: OC(=O)c1c[nH]c2ccc(cc12)-c1ccc(cc1)-c1c(O)cccc1O
InChI Key: InChIKey=GQAXJYFQZNZNIM-UHFFFAOYSA-N
Data: 2 EC50
Activity Spreadsheet -- Enzyme Inhibition Constant Data from BindingDB
Found 2 hits for monomerid = 50195479
Trg + Lig
Ki
nM
ΔG°
kcal/mole
IC50
nM
Kd
nM
EC50/IC50
nM
koff
s-1
kon
M-1s-1
pHTemp
°C
AMPK alpha2/beta2/gamma3
(Homo sapiens (Human))
BDBM50195479
(CHEMBL3950376)
Show SMILES OC(=O)c1c[nH]c2ccc(cc12)-c1ccc(cc1)-c1c(O)cccc1O
Show InChI InChI=1S/C21H15NO4/c23-18-2-1-3-19(24)20(18)13-6-4-12(5-7-13)14-8-9-17-15(10-14)16(11-22-17)21(25)26/h1-11,22-24H,(H,25,26)
n/an/an/an/a<5.00E+3n/an/an/an/a
Pfizer Inc.
Curated by ChEMBL
Assay Description
Activation of human recombinant AMPK beta2 expressed in African green monkey COS7 cells or baculovirus infected insect cells assessed as increase in ...
Bioorg Med Chem Lett 26: 5139-5148 (2016)
Article DOI: 10.1016/j.bmcl.2016.09.065
BindingDB Entry DOI: 10.7270/Q25M67PH
5'-AMP-activated protein kinase subunit beta-1
(Homo sapiens (Human))
BDBM50195479
(CHEMBL3950376)
Show SMILES OC(=O)c1c[nH]c2ccc(cc12)-c1ccc(cc1)-c1c(O)cccc1O
Show InChI InChI=1S/C21H15NO4/c23-18-2-1-3-19(24)20(18)13-6-4-12(5-7-13)14-8-9-17-15(10-14)16(11-22-17)21(25)26/h1-11,22-24H,(H,25,26)
n/an/an/an/a<500n/an/an/an/a
Pfizer Inc.
Curated by ChEMBL
Assay Description
Activation of human recombinant AMPK beta1 expressed in African green monkey COS7 cells or baculovirus infected insect cells assessed as increase in ...
Bioorg Med Chem Lett 26: 5139-5148 (2016)
Article DOI: 10.1016/j.bmcl.2016.09.065
BindingDB Entry DOI: 10.7270/Q25M67PH