BDBM50195562 4-[1,2-bis(4-chlorophenyl)-5-hydroxy-3-oxo-2,3-dihydro-1Hpyrazole-4-carbonyl]aminobenzoic acid ethyl ester::CHEMBL217390
SMILES: CCOC(=O)c1ccc(cc1)C(=O)c1c(O)n(-c2ccc(Cl)cc2)n(-c2ccc(Cl)cc2)c1=O
InChI Key: InChIKey=RMPDCFTYDPSTDJ-UHFFFAOYSA-N
Data: 1 IC50
Activity Spreadsheet -- Enzyme Inhibition Constant Data from BindingDB
Found 1 hit for monomerid = 50195562
Trg + Lig
Ki
nM
ΔG°
kcal/mole
IC50
nM
Kd
nM
EC50/IC50
nM
koff
s-1
kon
M-1s-1
pHTemp
°C
MurB (E. coli)
(Escherichia coli K-12 (Enterobacteria))
BDBM50195562
(4-[1,2-bis(4-chlorophenyl)-5-hydroxy-3-oxo-2,3-dih...)
Show SMILES CCOC(=O)c1ccc(cc1)C(=O)c1c(O)n(-c2ccc(Cl)cc2)n(-c2ccc(Cl)cc2)c1=O
Show InChI InChI=1S/C25H18Cl2N2O5/c1-2-34-25(33)16-5-3-15(4-6-16)22(30)21-23(31)28(19-11-7-17(26)8-12-19)29(24(21)32)20-13-9-18(27)10-14-20/h3-14,31H,2H2,1H3
n/an/a 1.76E+4n/an/an/an/an/an/a
Wyeth
Curated by ChEMBL
Assay Description
Inhibition of MurB activity
J Med Chem 49: 6027-36 (2006)
Article DOI: 10.1021/jm060499t
BindingDB Entry DOI: 10.7270/Q22V2FRV