BDBM50195572 1,2-bis(4-chlorophenyl)-5-hydroxy-3-oxo-2,3-dihydro-1H-pyrazole-4-carboxylic acid phenethylamide::CHEMBL217426
SMILES: Oc1c(C(=O)CCc2ccccc2)c(=O)n(-c2ccc(Cl)cc2)n1-c1ccc(Cl)cc1
InChI Key: InChIKey=XOBMFSVTGCTEJT-UHFFFAOYSA-N
Data: 1 IC50
Activity Spreadsheet -- Enzyme Inhibition Constant Data from BindingDB
Found 1 hit for monomerid = 50195572
Trg + Lig
Ki
nM
ΔG°
kcal/mole
IC50
nM
Kd
nM
EC50/IC50
nM
koff
s-1
kon
M-1s-1
pHTemp
°C
MurB (E. coli)
(Escherichia coli K-12 (Enterobacteria))
BDBM50195572
(1,2-bis(4-chlorophenyl)-5-hydroxy-3-oxo-2,3-dihydr...)
Show SMILES Oc1c(C(=O)CCc2ccccc2)c(=O)n(-c2ccc(Cl)cc2)n1-c1ccc(Cl)cc1
Show InChI InChI=1S/C24H18Cl2N2O3/c25-17-7-11-19(12-8-17)27-23(30)22(21(29)15-6-16-4-2-1-3-5-16)24(31)28(27)20-13-9-18(26)10-14-20/h1-5,7-14,30H,6,15H2
n/an/a 9.60E+3n/an/an/an/an/an/a
Wyeth
Curated by ChEMBL
Assay Description
Inhibition of MurB activity
J Med Chem 49: 6027-36 (2006)
Article DOI: 10.1021/jm060499t
BindingDB Entry DOI: 10.7270/Q22V2FRV