BDBM50195612 CHEMBL384013::N-hydroxy-4-(3,4-dihydro-4-oxo-6-phenyl-2-pyrimidinylthio)butanamide
SMILES: ONC(=O)CCCSc1nc(cc(=O)[nH]1)-c1ccccc1
InChI Key: InChIKey=FMBALXLGRFCPAK-UHFFFAOYSA-N
Data: 2 IC50
Activity Spreadsheet -- Enzyme Inhibition Constant Data from BindingDB
Found 2 hits for monomerid = 50195612
Trg + Lig
Ki
nM
ΔG°
kcal/mole
IC50
nM
Kd
nM
EC50/IC50
nM
koff
s-1
kon
M-1s-1
pHTemp
°C
Histone deacetylase HD2
(Zea mays)
BDBM50195612
(CHEMBL384013 | N-hydroxy-4-(3,4-dihydro-4-oxo-6-ph...)
Show SMILES ONC(=O)CCCSc1nc(cc(=O)[nH]1)-c1ccccc1
Show InChI InChI=1S/C14H15N3O3S/c18-12(17-20)7-4-8-21-14-15-11(9-13(19)16-14)10-5-2-1-3-6-10/h1-3,5-6,9,20H,4,7-8H2,(H,17,18)(H,15,16,19)
n/an/a 27n/an/an/an/an/an/a
Università degli Studi di Roma La Sapienza
Curated by ChEMBL
Assay Description
Inhibition of maize HD2
J Med Chem 49: 6046-56 (2006)
Article DOI: 10.1021/jm0605536
BindingDB Entry DOI: 10.7270/Q2Z31Z9B
Histone deacetylase HD1B
(Zea mays)
BDBM50195612
(CHEMBL384013 | N-hydroxy-4-(3,4-dihydro-4-oxo-6-ph...)
Show SMILES ONC(=O)CCCSc1nc(cc(=O)[nH]1)-c1ccccc1
Show InChI InChI=1S/C14H15N3O3S/c18-12(17-20)7-4-8-21-14-15-11(9-13(19)16-14)10-5-2-1-3-6-10/h1-3,5-6,9,20H,4,7-8H2,(H,17,18)(H,15,16,19)
n/an/a 31n/an/an/an/an/an/a
Università degli Studi di Roma La Sapienza
Curated by ChEMBL
Assay Description
Inhibition of maize HD1B
J Med Chem 49: 6046-56 (2006)
Article DOI: 10.1021/jm0605536
BindingDB Entry DOI: 10.7270/Q2Z31Z9B