BDBM50195633 3beta-acetoxy-23,24-bisnor-chol-5-en-22-(methyl ethanoate) amine::CHEMBL214526
SMILES: COC(=O)CNC[C@@H](C)[C@H]1CC[C@H]2C3CC=C4C[C@H](CC[C@]4(C)[C@H]3CC[C@]12C)OC(C)=O
InChI Key: InChIKey=RHXHNOLOJMIDPC-OESCZPMMSA-N
Data: 1 IC50
Activity Spreadsheet -- Enzyme Inhibition Constant Data from BindingDB
Found 1 hit for monomerid = 50195633
Trg + Lig
Ki
nM
ΔG°
kcal/mole
IC50
nM
Kd
nM
EC50/IC50
nM
koff
s-1
kon
M-1s-1
pHTemp
°C
24-sterol C-methyltransferase
(Arabidopsis thaliana)
BDBM50195633
(3beta-acetoxy-23,24-bisnor-chol-5-en-22-(methyl et...)
Show SMILES COC(=O)CNC[C@@H](C)[C@H]1CC[C@H]2C3CC=C4C[C@H](CC[C@]4(C)[C@H]3CC[C@]12C)OC(C)=O |t:15|
Show InChI InChI=1S/C27H43NO4/c1-17(15-28-16-25(30)31-5)22-8-9-23-21-7-6-19-14-20(32-18(2)29)10-12-26(19,3)24(21)11-13-27(22,23)4/h6,17,20-24,28H,7-16H2,1-5H3/t17-,20+,21?,22-,23+,24+,26+,27-/m1/s1
n/an/a>1.00E+5n/an/an/an/an/an/a
Cardiff University
Curated by ChEMBL
Assay Description
Inhibition of Leishmania major recombinant 24-SMT
J Med Chem 49: 6094-103 (2006)
Article DOI: 10.1021/jm060290f
BindingDB Entry DOI: 10.7270/Q2TB16JJ