BDBM50195637 3beta-ol-23,24-bisnor-5-en-22-(ethanoic acid) amine::CHEMBL217129
SMILES: C[C@H](CNCC(O)=O)[C@H]1CC[C@H]2C3CC=C4C[C@@H](O)CC[C@]4(C)[C@H]3CC[C@]12C
InChI Key: InChIKey=AKSZCKNBEJCUHG-MRTQKXPXSA-N
Data: 1 IC50
Activity Spreadsheet -- Enzyme Inhibition Constant Data from BindingDB
Found 1 hit for monomerid = 50195637
Trg + Lig
Ki
nM
ΔG°
kcal/mole
IC50
nM
Kd
nM
EC50/IC50
nM
koff
s-1
kon
M-1s-1
pHTemp
°C
24-sterol C-methyltransferase
(Arabidopsis thaliana)
BDBM50195637
(3beta-ol-23,24-bisnor-5-en-22-(ethanoic acid) amin...)
Show SMILES C[C@H](CNCC(O)=O)[C@H]1CC[C@H]2C3CC=C4C[C@@H](O)CC[C@]4(C)[C@H]3CC[C@]12C |t:14|
Show InChI InChI=1S/C24H39NO3/c1-15(13-25-14-22(27)28)19-6-7-20-18-5-4-16-12-17(26)8-10-23(16,2)21(18)9-11-24(19,20)3/h4,15,17-21,25-26H,5-14H2,1-3H3,(H,27,28)/t15-,17+,18?,19-,20+,21+,23+,24-/m1/s1
n/an/a>1.00E+5n/an/an/an/an/an/a
Cardiff University
Curated by ChEMBL
Assay Description
Inhibition of Leishmania major recombinant 24-SMT
J Med Chem 49: 6094-103 (2006)
Article DOI: 10.1021/jm060290f
BindingDB Entry DOI: 10.7270/Q2TB16JJ