BDBM50195854 CHEMBL220517::NSC-102359::cid_3280136
SMILES: CCOP(=O)(Nc1ccc-2c(c1)C(=NNC(N)=S)c1ccccc-21)OCC
InChI Key: InChIKey=SVLUVZOAZMQSLH-UHFFFAOYSA-N
Data: 2 IC50
Activity Spreadsheet -- Enzyme Inhibition Constant Data from BindingDB
Found 2 hits for monomerid = 50195854
Trg + Lig
Ki
nM
ΔG°
kcal/mole
IC50
nM
Kd
nM
EC50/IC50
nM
koff
s-1
kon
M-1s-1
pHTemp
°C
NAD(P)H dehydrogenase [quinone] 1
(Homo sapiens (Human))
BDBM50195854
(CHEMBL220517 | NSC-102359 | cid_3280136)
Show SMILES CCOP(=O)(Nc1ccc-2c(c1)C(=NNC(N)=S)c1ccccc-21)OCC |w:13.14|
Show InChI InChI=1S/C18H21N4O3PS/c1-3-24-26(23,25-4-2)22-12-9-10-14-13-7-5-6-8-15(13)17(16(14)11-12)20-21-18(19)27/h5-11H,3-4H2,1-2H3,(H,22,23)(H3,19,21,27)
Reactome pathway
n/an/a 2.50E+5n/an/an/an/an/an/a
University of Manchester
Curated by ChEMBL
Assay Description
Inhibition of human recombinant NQO1
Bioorg Med Chem Lett 16: 6246-54 (2006)
Article DOI: 10.1016/j.bmcl.2006.09.015
BindingDB Entry DOI: 10.7270/Q2V988WG
MSRA protein
(Bos taurus)
BDBM50195854
(CHEMBL220517 | NSC-102359 | cid_3280136)
Show SMILES CCOP(=O)(Nc1ccc-2c(c1)C(=NNC(N)=S)c1ccccc-21)OCC |w:13.14|
Show InChI InChI=1S/C18H21N4O3PS/c1-3-24-26(23,25-4-2)22-12-9-10-14-13-7-5-6-8-15(13)17(16(14)11-12)20-21-18(19)27/h5-11H,3-4H2,1-2H3,(H,22,23)(H3,19,21,27)
PCBioAssay
n/an/a 9.59E+4n/an/an/an/an/an/a
The Scripps Research Institute Molecular Screening Center
Curated by PubChem BioAssay
PubChem Bioassay (2013)
BindingDB Entry DOI: 10.7270/Q2639NCQ