null
SMILES: CNC(=N)NCCC[C@H](NC(=O)[C@H](CC(C)C)NC(=O)NNC(=O)[C@H](Cc1ccccc1)NC(=O)[C@@H](NC(=O)[C@H](CC(N)=O)NC(=O)[C@H](C)NC(=O)[C@@H](Cc1ccc(O)cc1)NC(C)=O)[C@@H](C)O)C(=O)N[C@@H](Cc1c[nH]c2ccccc12)C(N)=O
InChI Key: InChIKey=JXBWAELETYVLOH-AQWUIIHPSA-N
Activity Spreadsheet -- Enzyme Inhibition Constant Data from BindingDB
Found 2 hits for monomerid = 50196442
Trg + Lig
Ki
nM
ΔG°
kcal/mole
IC50
nM
Kd
nM
EC50/IC50
nM
koff
s-1
kon
M-1s-1
pHTemp
°C
KiSS-1 receptor
(Homo sapiens (Human))
BDBM50196442
(CHEMBL3915251)
Show SMILES CNC(=N)NCCC[C@H](NC(=O)[C@H](CC(C)C)NC(=O)NNC(=O)[C@H](Cc1ccccc1)NC(=O)[C@@H](NC(=O)[C@H](CC(N)=O)NC(=O)[C@H](C)NC(=O)[C@@H](Cc1ccc(O)cc1)NC(C)=O)[C@@H](C)O)C(=O)N[C@@H](Cc1c[nH]c2ccccc12)C(N)=O |r|
Show InChI InChI=1S/C56H78N16O13/c1-29(2)23-41(51(81)65-39(17-12-22-61-55(59)60-6)49(79)66-40(47(58)77)26-35-28-62-38-16-11-10-15-37(35)38)69-56(85)72-71-53(83)43(24-33-13-8-7-9-14-33)68-54(84)46(31(4)73)70-52(82)44(27-45(57)76)67-48(78)30(3)63-50(80)42(64-32(5)74)25-34-18-20-36(75)21-19-34/h7-11,13-16,18-21,28-31,39-44,46,62,73,75H,12,17,22-27H2,1-6H3,(H2,57,76)(H2,58,77)(H,63,80)(H,64,74)(H,65,81)(H,66,79)(H,67,78)(H,68,84)(H,70,82)(H,71,83)(H3,59,60,61)(H2,69,72,85)/t30-,31+,39-,40-,41-,42+,43-,44-,46-/m0/s1
Reactome pathway
n/an/an/an/a 1.20n/an/an/an/a
Takeda Pharmaceutical Company Ltd
Curated by ChEMBL
Assay Description
Agonist activity at human KISS1R expressed in CHO/dhfr cells assessed as increase in intracellular Ca2+ levels measured for 180 secs by Fluo 3-AM dye...
J Med Chem 59: 8804-8811 (2016)
Article DOI: 10.1021/acs.jmedchem.6b00379
BindingDB Entry DOI: 10.7270/Q2000425
KiSS-1 receptor
(Rattus norvegicus)
BDBM50196442
(CHEMBL3915251)
Show SMILES CNC(=N)NCCC[C@H](NC(=O)[C@H](CC(C)C)NC(=O)NNC(=O)[C@H](Cc1ccccc1)NC(=O)[C@@H](NC(=O)[C@H](CC(N)=O)NC(=O)[C@H](C)NC(=O)[C@@H](Cc1ccc(O)cc1)NC(C)=O)[C@@H](C)O)C(=O)N[C@@H](Cc1c[nH]c2ccccc12)C(N)=O |r|
Show InChI InChI=1S/C56H78N16O13/c1-29(2)23-41(51(81)65-39(17-12-22-61-55(59)60-6)49(79)66-40(47(58)77)26-35-28-62-38-16-11-10-15-37(35)38)69-56(85)72-71-53(83)43(24-33-13-8-7-9-14-33)68-54(84)46(31(4)73)70-52(82)44(27-45(57)76)67-48(78)30(3)63-50(80)42(64-32(5)74)25-34-18-20-36(75)21-19-34/h7-11,13-16,18-21,28-31,39-44,46,62,73,75H,12,17,22-27H2,1-6H3,(H2,57,76)(H2,58,77)(H,63,80)(H,64,74)(H,65,81)(H,66,79)(H,67,78)(H,68,84)(H,70,82)(H,71,83)(H3,59,60,61)(H2,69,72,85)/t30-,31+,39-,40-,41-,42+,43-,44-,46-/m0/s1
Reactome pathway
n/an/an/an/a 6n/an/an/an/a
Takeda Pharmaceutical Company Ltd
Curated by ChEMBL
Assay Description
Agonist activity at rat KISS1R expressed in CHO/dhfr cells assessed as increase in intracellular Ca2+ levels measured for 180 secs by Fluo 3-AM dye b...
J Med Chem 59: 8804-8811 (2016)
Article DOI: 10.1021/acs.jmedchem.6b00379
BindingDB Entry DOI: 10.7270/Q2000425