BDBM50196487 CHEMBL3984942
SMILES: CCCCCCNC(=O)Nc1ccc(cc1)C(\N)=N\O
InChI Key: InChIKey=CMZIQNGLQHXGMN-UHFFFAOYSA-N
Data: 1 IC50
Activity Spreadsheet -- Enzyme Inhibition Constant Data from BindingDB
Found 1 hit for monomerid = 50196487
Trg + Lig
Ki
nM
ΔG°
kcal/mole
IC50
nM
Kd
nM
EC50/IC50
nM
koff
s-1
kon
M-1s-1
pHTemp
°C
Histone deacetylase (HDAC1 and HDAC2)
(Homo sapiens (Human))
BDBM50196487
(CHEMBL3984942)
Show SMILES CCCCCCNC(=O)Nc1ccc(cc1)C(\N)=N\O
Show InChI InChI=1S/C14H22N4O2/c1-2-3-4-5-10-16-14(19)17-12-8-6-11(7-9-12)13(15)18-20/h6-9,20H,2-5,10H2,1H3,(H2,15,18)(H2,16,17,19)
n/an/a 599n/an/an/an/an/an/a
Qilu Normal University
Curated by ChEMBL
Assay Description
Inhibition of HDAC1/HDAC2 in human HeLa cell nuclear extract preincubated for 20 mins followed by addition of HDAC green as substrate measured after ...
Bioorg Med Chem Lett 26: 4679-4683 (2016)
Article DOI: 10.1016/j.bmcl.2016.08.073
BindingDB Entry DOI: 10.7270/Q2V69MKX