BDBM50196603 7-(4-(2-(1H-indol-3-yl)acetamido)-2-fluorophenyl1H-indol-3-yl)acetamido)-2-fluorophenoxy)-N-hydroxyheptanamide::CHEMBL217564
SMILES: ONC(=O)CCCCCCOc1ccc(NC(=O)Cc2c[nH]c3ccccc23)cc1F
InChI Key: InChIKey=SCYRNQUNRQOOHP-UHFFFAOYSA-N
Data: 1 IC50
Activity Spreadsheet -- Enzyme Inhibition Constant Data from BindingDB
Found 1 hit for monomerid = 50196603
Trg + Lig
Ki
nM
ΔG°
kcal/mole
IC50
nM
Kd
nM
EC50/IC50
nM
koff
s-1
kon
M-1s-1
pHTemp
°C
Histone deacetylase 1
(Homo sapiens (Human))
BDBM50196603
(7-(4-(2-(1H-indol-3-yl)acetamido)-2-fluorophenyl1H...)
Show SMILES ONC(=O)CCCCCCOc1ccc(NC(=O)Cc2c[nH]c3ccccc23)cc1F
Show InChI InChI=1S/C23H26FN3O4/c24-19-14-17(10-11-21(19)31-12-6-2-1-3-9-22(28)27-30)26-23(29)13-16-15-25-20-8-5-4-7-18(16)20/h4-5,7-8,10-11,14-15,25,30H,1-3,6,9,12-13H2,(H,26,29)(H,27,28)
NCI pathway
Reactome pathway
n/an/a 13n/an/an/an/an/an/a
University College London
Curated by ChEMBL
Assay Description
In vitro inhibition of histone deacetylase activity using HeLa cell nuclear extract as enzyme source
Bioorg Med Chem Lett 17: 136-41 (2006)
Article DOI: 10.1016/j.bmcl.2006.09.085
BindingDB Entry DOI: 10.7270/Q2B56JDQ