BDBM50196829 CHEMBL3914729
SMILES: CS(=O)(=O)c1ccc(O[C@@H]2[C@H](Cc3c2cc(Cl)cc3Cl)N2CCCNCC2)cc1
InChI Key: InChIKey=KNXKSCOYGZWIAE-SFTDATJTSA-N
Data: 2 IC50
Activity Spreadsheet -- Enzyme Inhibition Constant Data from BindingDB
Found 2 hits for monomerid = 50196829
Trg + Lig
Ki
nM
ΔG°
kcal/mole
IC50
nM
Kd
nM
EC50/IC50
nM
koff
s-1
kon
M-1s-1
pHTemp
°C
Sodium/hydrogen exchanger 3
(Homo sapiens (Human))
BDBM50196829
(CHEMBL3914729)
Show SMILES CS(=O)(=O)c1ccc(O[C@@H]2[C@H](Cc3c2cc(Cl)cc3Cl)N2CCCNCC2)cc1 |r|
Show InChI InChI=1S/C21H24Cl2N2O3S/c1-29(26,27)16-5-3-15(4-6-16)28-21-18-11-14(22)12-19(23)17(18)13-20(21)25-9-2-7-24-8-10-25/h3-6,11-12,20-21,24H,2,7-10,13H2,1H3/t20-,21-/m0/s1
n/an/a 6n/an/an/an/an/an/a
Sanofi-Aventis Deutschland GmbH
Curated by ChEMBL
Assay Description
Inhibition of human NHE3 expressed in LAP1 cell assessed as intracellular pH recovery measured for 2 mins by CECF-AM dye based FLIPR assay
J Med Chem 59: 8812-8829 (2016)
Article DOI: 10.1021/acs.jmedchem.6b00624
BindingDB Entry DOI: 10.7270/Q2FX7CDJ
Cytochrome P450 2D6
(Homo sapiens (Human))
BDBM50196829
(CHEMBL3914729)
Show SMILES CS(=O)(=O)c1ccc(O[C@@H]2[C@H](Cc3c2cc(Cl)cc3Cl)N2CCCNCC2)cc1 |r|
Show InChI InChI=1S/C21H24Cl2N2O3S/c1-29(26,27)16-5-3-15(4-6-16)28-21-18-11-14(22)12-19(23)17(18)13-20(21)25-9-2-7-24-8-10-25/h3-6,11-12,20-21,24H,2,7-10,13H2,1H3/t20-,21-/m0/s1
n/an/a<300n/an/an/an/an/an/a
Sanofi-Aventis Deutschland GmbH
Curated by ChEMBL
Assay Description
Inhibition of CYP2D6 in pooled human hepatic microsomes using dextromethorphan substrate in presence of NADPH
J Med Chem 59: 8812-8829 (2016)
Article DOI: 10.1021/acs.jmedchem.6b00624
BindingDB Entry DOI: 10.7270/Q2FX7CDJ