BDBM50197025 CHEMBL439904::PYY(3-36)
SMILES: CC[C@H](C)[C@H](N)C(=O)N[C@@H](CCCCN)C(=O)N1CCC[C@H]1C(=O)N[C@@H](CCC(O)=O)C(=O)N[C@@H](C)C(=O)N1CCC[C@H]1C(=O)NCC(=O)N[C@@H](CCC(O)=O)C(=O)N[C@@H](CC(O)=O)C(=O)N[C@@H](C)C(=O)N[C@@H](CO)C(=O)N1CCC[C@H]1C(=O)N[C@@H](CCC(O)=O)C(=O)N[C@@H](CCC(O)=O)C(=O)N[C@@H](CC(C)C)C(=O)N[C@@H](CC(N)=O)C(=O)N[C@@H](CCCNC(N)=N)C(=O)N[C@@H](Cc1ccc(O)cc1)C(=O)N[C@@H](Cc1ccc(O)cc1)C(=O)N[C@@H](C)C(=O)N[C@@H](CO)C(=O)N[C@@H](CC(C)C)C(=O)N[C@@H](CCCNC(N)=N)C(=O)N[C@@H](Cc1cnc[nH]1)C(=O)N[C@@H](Cc1ccc(O)cc1)C(=O)N[C@@H](CC(C)C)C(=O)N[C@@H](CC(N)=O)C(=O)N[C@@H](CC(C)C)C(=O)N[C@@H](C(C)C)C(=O)N[C@@H]([C@@H](C)O)C(=O)N[C@@H](CCCNC(N)=N)C(=O)N[C@@H](CCC(N)=O)C(=O)N[C@@H](CCCNC(N)=N)C(=O)N[C@@H](Cc1ccc(O)cc1)C(N)=O
InChI Key: InChIKey=AUHJXHCVECGTKR-DQNUUZSMSA-N
Data: 3 KI  2 IC50  7 EC50
Activity Spreadsheet -- Enzyme Inhibition Constant Data from BindingDB
Found 19 hits for monomerid = 50197025
Trg + Lig
Ki
nM
ΔG°
kcal/mole
IC50
nM
Kd
nM
EC50/IC50
nM
koff
s-1
kon
M-1s-1
pHTemp
°C
Neuropeptide Y receptor type 2
(Homo sapiens (Human))
BDBM50197025
(CHEMBL439904 | PYY(3-36))
Show SMILES CC[C@H](C)[C@H](N)C(=O)N[C@@H](CCCCN)C(=O)N1CCC[C@H]1C(=O)N[C@@H](CCC(O)=O)C(=O)N[C@@H](C)C(=O)N1CCC[C@H]1C(=O)NCC(=O)N[C@@H](CCC(O)=O)C(=O)N[C@@H](CC(O)=O)C(=O)N[C@@H](C)C(=O)N[C@@H](CO)C(=O)N1CCC[C@H]1C(=O)N[C@@H](CCC(O)=O)C(=O)N[C@@H](CCC(O)=O)C(=O)N[C@@H](CC(C)C)C(=O)N[C@@H](CC(N)=O)C(=O)N[C@@H](CCCNC(N)=N)C(=O)N[C@@H](Cc1ccc(O)cc1)C(=O)N[C@@H](Cc1ccc(O)cc1)C(=O)N[C@@H](C)C(=O)N[C@@H](CO)C(=O)N[C@@H](CC(C)C)C(=O)N[C@@H](CCCNC(N)=N)C(=O)N[C@@H](Cc1cnc[nH]1)C(=O)N[C@@H](Cc1ccc(O)cc1)C(=O)N[C@@H](CC(C)C)C(=O)N[C@@H](CC(N)=O)C(=O)N[C@@H](CC(C)C)C(=O)N[C@@H](C(C)C)C(=O)N[C@@H]([C@@H](C)O)C(=O)N[C@@H](CCCNC(N)=N)C(=O)N[C@@H](CCC(N)=O)C(=O)N[C@@H](CCCNC(N)=N)C(=O)N[C@@H](Cc1ccc(O)cc1)C(N)=O
Show InChI InChI=1S/C180H279N53O54/c1-17-91(12)141(185)171(282)214-114(27-18-19-61-181)175(286)232-67-25-33-130(232)169(280)211-111(53-58-137(247)248)147(258)204-94(15)174(285)231-66-24-32-129(231)168(279)200-82-135(244)205-109(52-57-136(245)246)152(263)226-126(80-140(253)254)157(268)203-93(14)146(257)228-128(84-235)176(287)233-68-26-34-131(233)170(281)212-113(55-60-139(251)252)154(265)210-112(54-59-138(249)250)155(266)216-117(70-87(4)5)159(270)224-124(78-133(183)242)164(275)208-106(29-21-63-197-178(189)190)150(261)220-121(75-98-39-47-103(239)48-40-98)162(273)221-120(74-97-37-45-102(238)46-38-97)156(267)202-92(13)145(256)227-127(83-234)167(278)219-116(69-86(2)3)158(269)207-107(30-22-64-198-179(191)192)151(262)223-123(77-100-81-195-85-201-100)163(274)222-122(76-99-41-49-104(240)50-42-99)161(272)217-118(71-88(6)7)160(271)225-125(79-134(184)243)165(276)218-119(72-89(8)9)166(277)229-142(90(10)11)172(283)230-143(95(16)236)173(284)213-108(31-23-65-199-180(193)194)148(259)209-110(51-56-132(182)241)153(264)206-105(28-20-62-196-177(187)188)149(260)215-115(144(186)255)73-96-35-43-101(237)44-36-96/h35-50,81,85-95,105-131,141-143,234-240H,17-34,51-80,82-84,181,185H2,1-16H3,(H2,182,241)(H2,183,242)(H2,184,243)(H2,186,255)(H,195,201)(H,200,279)(H,202,267)(H,203,268)(H,204,258)(H,205,244)(H,206,264)(H,207,269)(H,208,275)(H,209,259)(H,210,265)(H,211,280)(H,212,281)(H,213,284)(H,214,282)(H,215,260)(H,216,266)(H,217,272)(H,218,276)(H,219,278)(H,220,261)(H,221,273)(H,222,274)(H,223,262)(H,224,270)(H,225,271)(H,226,263)(H,227,256)(H,228,257)(H,229,277)(H,230,283)(H,245,246)(H,247,248)(H,249,250)(H,251,252)(H,253,254)(H4,187,188,196)(H4,189,190,197)(H4,191,192,198)(H4,193,194,199)/t91-,92-,93-,94-,95+,105-,106-,107-,108-,109-,110-,111-,112-,113-,114-,115-,116-,117-,118-,119-,120-,121-,122-,123-,124-,125-,126-,127-,128-,129-,130-,131-,141-,142-,143-/m0/s1
Reactome pathway
0.400n/an/an/an/an/an/an/an/a
Bayer Pharmaceuticals Corporation
Curated by ChEMBL
Assay Description
Displacement of human [125I]PYY from NPY2 receptor expressed in human KAN-TS cells
Bioorg Med Chem Lett 17: 538-41 (2007)
Article DOI: 10.1016/j.bmcl.2006.10.007
BindingDB Entry DOI: 10.7270/Q2959H6F
Neuropeptide Y receptor type 5 ( NPY Y5)
(Homo sapiens (Human))
BDBM50197025
(CHEMBL439904 | PYY(3-36))
Show SMILES CC[C@H](C)[C@H](N)C(=O)N[C@@H](CCCCN)C(=O)N1CCC[C@H]1C(=O)N[C@@H](CCC(O)=O)C(=O)N[C@@H](C)C(=O)N1CCC[C@H]1C(=O)NCC(=O)N[C@@H](CCC(O)=O)C(=O)N[C@@H](CC(O)=O)C(=O)N[C@@H](C)C(=O)N[C@@H](CO)C(=O)N1CCC[C@H]1C(=O)N[C@@H](CCC(O)=O)C(=O)N[C@@H](CCC(O)=O)C(=O)N[C@@H](CC(C)C)C(=O)N[C@@H](CC(N)=O)C(=O)N[C@@H](CCCNC(N)=N)C(=O)N[C@@H](Cc1ccc(O)cc1)C(=O)N[C@@H](Cc1ccc(O)cc1)C(=O)N[C@@H](C)C(=O)N[C@@H](CO)C(=O)N[C@@H](CC(C)C)C(=O)N[C@@H](CCCNC(N)=N)C(=O)N[C@@H](Cc1cnc[nH]1)C(=O)N[C@@H](Cc1ccc(O)cc1)C(=O)N[C@@H](CC(C)C)C(=O)N[C@@H](CC(N)=O)C(=O)N[C@@H](CC(C)C)C(=O)N[C@@H](C(C)C)C(=O)N[C@@H]([C@@H](C)O)C(=O)N[C@@H](CCCNC(N)=N)C(=O)N[C@@H](CCC(N)=O)C(=O)N[C@@H](CCCNC(N)=N)C(=O)N[C@@H](Cc1ccc(O)cc1)C(N)=O
Show InChI InChI=1S/C180H279N53O54/c1-17-91(12)141(185)171(282)214-114(27-18-19-61-181)175(286)232-67-25-33-130(232)169(280)211-111(53-58-137(247)248)147(258)204-94(15)174(285)231-66-24-32-129(231)168(279)200-82-135(244)205-109(52-57-136(245)246)152(263)226-126(80-140(253)254)157(268)203-93(14)146(257)228-128(84-235)176(287)233-68-26-34-131(233)170(281)212-113(55-60-139(251)252)154(265)210-112(54-59-138(249)250)155(266)216-117(70-87(4)5)159(270)224-124(78-133(183)242)164(275)208-106(29-21-63-197-178(189)190)150(261)220-121(75-98-39-47-103(239)48-40-98)162(273)221-120(74-97-37-45-102(238)46-38-97)156(267)202-92(13)145(256)227-127(83-234)167(278)219-116(69-86(2)3)158(269)207-107(30-22-64-198-179(191)192)151(262)223-123(77-100-81-195-85-201-100)163(274)222-122(76-99-41-49-104(240)50-42-99)161(272)217-118(71-88(6)7)160(271)225-125(79-134(184)243)165(276)218-119(72-89(8)9)166(277)229-142(90(10)11)172(283)230-143(95(16)236)173(284)213-108(31-23-65-199-180(193)194)148(259)209-110(51-56-132(182)241)153(264)206-105(28-20-62-196-177(187)188)149(260)215-115(144(186)255)73-96-35-43-101(237)44-36-96/h35-50,81,85-95,105-131,141-143,234-240H,17-34,51-80,82-84,181,185H2,1-16H3,(H2,182,241)(H2,183,242)(H2,184,243)(H2,186,255)(H,195,201)(H,200,279)(H,202,267)(H,203,268)(H,204,258)(H,205,244)(H,206,264)(H,207,269)(H,208,275)(H,209,259)(H,210,265)(H,211,280)(H,212,281)(H,213,284)(H,214,282)(H,215,260)(H,216,266)(H,217,272)(H,218,276)(H,219,278)(H,220,261)(H,221,273)(H,222,274)(H,223,262)(H,224,270)(H,225,271)(H,226,263)(H,227,256)(H,228,257)(H,229,277)(H,230,283)(H,245,246)(H,247,248)(H,249,250)(H,251,252)(H,253,254)(H4,187,188,196)(H4,189,190,197)(H4,191,192,198)(H4,193,194,199)/t91-,92-,93-,94-,95+,105-,106-,107-,108-,109-,110-,111-,112-,113-,114-,115-,116-,117-,118-,119-,120-,121-,122-,123-,124-,125-,126-,127-,128-,129-,130-,131-,141-,142-,143-/m0/s1
20n/an/an/an/an/an/an/an/a
Bayer Pharmaceuticals Corporation
Curated by ChEMBL
Assay Description
Displacement of [125I]PYY from NPY5 receptor expressed in human HEK293 cells
Bioorg Med Chem Lett 17: 538-41 (2007)
Article DOI: 10.1016/j.bmcl.2006.10.007
BindingDB Entry DOI: 10.7270/Q2959H6F
Neuropeptide Y receptor type 1
(Homo sapiens (Human))
BDBM50197025
(CHEMBL439904 | PYY(3-36))
Show SMILES CC[C@H](C)[C@H](N)C(=O)N[C@@H](CCCCN)C(=O)N1CCC[C@H]1C(=O)N[C@@H](CCC(O)=O)C(=O)N[C@@H](C)C(=O)N1CCC[C@H]1C(=O)NCC(=O)N[C@@H](CCC(O)=O)C(=O)N[C@@H](CC(O)=O)C(=O)N[C@@H](C)C(=O)N[C@@H](CO)C(=O)N1CCC[C@H]1C(=O)N[C@@H](CCC(O)=O)C(=O)N[C@@H](CCC(O)=O)C(=O)N[C@@H](CC(C)C)C(=O)N[C@@H](CC(N)=O)C(=O)N[C@@H](CCCNC(N)=N)C(=O)N[C@@H](Cc1ccc(O)cc1)C(=O)N[C@@H](Cc1ccc(O)cc1)C(=O)N[C@@H](C)C(=O)N[C@@H](CO)C(=O)N[C@@H](CC(C)C)C(=O)N[C@@H](CCCNC(N)=N)C(=O)N[C@@H](Cc1cnc[nH]1)C(=O)N[C@@H](Cc1ccc(O)cc1)C(=O)N[C@@H](CC(C)C)C(=O)N[C@@H](CC(N)=O)C(=O)N[C@@H](CC(C)C)C(=O)N[C@@H](C(C)C)C(=O)N[C@@H]([C@@H](C)O)C(=O)N[C@@H](CCCNC(N)=N)C(=O)N[C@@H](CCC(N)=O)C(=O)N[C@@H](CCCNC(N)=N)C(=O)N[C@@H](Cc1ccc(O)cc1)C(N)=O
Show InChI InChI=1S/C180H279N53O54/c1-17-91(12)141(185)171(282)214-114(27-18-19-61-181)175(286)232-67-25-33-130(232)169(280)211-111(53-58-137(247)248)147(258)204-94(15)174(285)231-66-24-32-129(231)168(279)200-82-135(244)205-109(52-57-136(245)246)152(263)226-126(80-140(253)254)157(268)203-93(14)146(257)228-128(84-235)176(287)233-68-26-34-131(233)170(281)212-113(55-60-139(251)252)154(265)210-112(54-59-138(249)250)155(266)216-117(70-87(4)5)159(270)224-124(78-133(183)242)164(275)208-106(29-21-63-197-178(189)190)150(261)220-121(75-98-39-47-103(239)48-40-98)162(273)221-120(74-97-37-45-102(238)46-38-97)156(267)202-92(13)145(256)227-127(83-234)167(278)219-116(69-86(2)3)158(269)207-107(30-22-64-198-179(191)192)151(262)223-123(77-100-81-195-85-201-100)163(274)222-122(76-99-41-49-104(240)50-42-99)161(272)217-118(71-88(6)7)160(271)225-125(79-134(184)243)165(276)218-119(72-89(8)9)166(277)229-142(90(10)11)172(283)230-143(95(16)236)173(284)213-108(31-23-65-199-180(193)194)148(259)209-110(51-56-132(182)241)153(264)206-105(28-20-62-196-177(187)188)149(260)215-115(144(186)255)73-96-35-43-101(237)44-36-96/h35-50,81,85-95,105-131,141-143,234-240H,17-34,51-80,82-84,181,185H2,1-16H3,(H2,182,241)(H2,183,242)(H2,184,243)(H2,186,255)(H,195,201)(H,200,279)(H,202,267)(H,203,268)(H,204,258)(H,205,244)(H,206,264)(H,207,269)(H,208,275)(H,209,259)(H,210,265)(H,211,280)(H,212,281)(H,213,284)(H,214,282)(H,215,260)(H,216,266)(H,217,272)(H,218,276)(H,219,278)(H,220,261)(H,221,273)(H,222,274)(H,223,262)(H,224,270)(H,225,271)(H,226,263)(H,227,256)(H,228,257)(H,229,277)(H,230,283)(H,245,246)(H,247,248)(H,249,250)(H,251,252)(H,253,254)(H4,187,188,196)(H4,189,190,197)(H4,191,192,198)(H4,193,194,199)/t91-,92-,93-,94-,95+,105-,106-,107-,108-,109-,110-,111-,112-,113-,114-,115-,116-,117-,118-,119-,120-,121-,122-,123-,124-,125-,126-,127-,128-,129-,130-,131-,141-,142-,143-/m0/s1
Reactome pathway
21n/an/an/an/an/an/an/an/a
Bayer Pharmaceuticals Corporation
Curated by ChEMBL
Assay Description
Displacement of [125I]PYY from NPY1 receptor expressed in human SK-N-MC cells
Bioorg Med Chem Lett 17: 538-41 (2007)
Article DOI: 10.1016/j.bmcl.2006.10.007
BindingDB Entry DOI: 10.7270/Q2959H6F
Neuropeptide Y receptor type 2
(Homo sapiens (Human))
BDBM50197025
(CHEMBL439904 | PYY(3-36))
Show SMILES CC[C@H](C)[C@H](N)C(=O)N[C@@H](CCCCN)C(=O)N1CCC[C@H]1C(=O)N[C@@H](CCC(O)=O)C(=O)N[C@@H](C)C(=O)N1CCC[C@H]1C(=O)NCC(=O)N[C@@H](CCC(O)=O)C(=O)N[C@@H](CC(O)=O)C(=O)N[C@@H](C)C(=O)N[C@@H](CO)C(=O)N1CCC[C@H]1C(=O)N[C@@H](CCC(O)=O)C(=O)N[C@@H](CCC(O)=O)C(=O)N[C@@H](CC(C)C)C(=O)N[C@@H](CC(N)=O)C(=O)N[C@@H](CCCNC(N)=N)C(=O)N[C@@H](Cc1ccc(O)cc1)C(=O)N[C@@H](Cc1ccc(O)cc1)C(=O)N[C@@H](C)C(=O)N[C@@H](CO)C(=O)N[C@@H](CC(C)C)C(=O)N[C@@H](CCCNC(N)=N)C(=O)N[C@@H](Cc1cnc[nH]1)C(=O)N[C@@H](Cc1ccc(O)cc1)C(=O)N[C@@H](CC(C)C)C(=O)N[C@@H](CC(N)=O)C(=O)N[C@@H](CC(C)C)C(=O)N[C@@H](C(C)C)C(=O)N[C@@H]([C@@H](C)O)C(=O)N[C@@H](CCCNC(N)=N)C(=O)N[C@@H](CCC(N)=O)C(=O)N[C@@H](CCCNC(N)=N)C(=O)N[C@@H](Cc1ccc(O)cc1)C(N)=O
Show InChI InChI=1S/C180H279N53O54/c1-17-91(12)141(185)171(282)214-114(27-18-19-61-181)175(286)232-67-25-33-130(232)169(280)211-111(53-58-137(247)248)147(258)204-94(15)174(285)231-66-24-32-129(231)168(279)200-82-135(244)205-109(52-57-136(245)246)152(263)226-126(80-140(253)254)157(268)203-93(14)146(257)228-128(84-235)176(287)233-68-26-34-131(233)170(281)212-113(55-60-139(251)252)154(265)210-112(54-59-138(249)250)155(266)216-117(70-87(4)5)159(270)224-124(78-133(183)242)164(275)208-106(29-21-63-197-178(189)190)150(261)220-121(75-98-39-47-103(239)48-40-98)162(273)221-120(74-97-37-45-102(238)46-38-97)156(267)202-92(13)145(256)227-127(83-234)167(278)219-116(69-86(2)3)158(269)207-107(30-22-64-198-179(191)192)151(262)223-123(77-100-81-195-85-201-100)163(274)222-122(76-99-41-49-104(240)50-42-99)161(272)217-118(71-88(6)7)160(271)225-125(79-134(184)243)165(276)218-119(72-89(8)9)166(277)229-142(90(10)11)172(283)230-143(95(16)236)173(284)213-108(31-23-65-199-180(193)194)148(259)209-110(51-56-132(182)241)153(264)206-105(28-20-62-196-177(187)188)149(260)215-115(144(186)255)73-96-35-43-101(237)44-36-96/h35-50,81,85-95,105-131,141-143,234-240H,17-34,51-80,82-84,181,185H2,1-16H3,(H2,182,241)(H2,183,242)(H2,184,243)(H2,186,255)(H,195,201)(H,200,279)(H,202,267)(H,203,268)(H,204,258)(H,205,244)(H,206,264)(H,207,269)(H,208,275)(H,209,259)(H,210,265)(H,211,280)(H,212,281)(H,213,284)(H,214,282)(H,215,260)(H,216,266)(H,217,272)(H,218,276)(H,219,278)(H,220,261)(H,221,273)(H,222,274)(H,223,262)(H,224,270)(H,225,271)(H,226,263)(H,227,256)(H,228,257)(H,229,277)(H,230,283)(H,245,246)(H,247,248)(H,249,250)(H,251,252)(H,253,254)(H4,187,188,196)(H4,189,190,197)(H4,191,192,198)(H4,193,194,199)/t91-,92-,93-,94-,95+,105-,106-,107-,108-,109-,110-,111-,112-,113-,114-,115-,116-,117-,118-,119-,120-,121-,122-,123-,124-,125-,126-,127-,128-,129-,130-,131-,141-,142-,143-/m0/s1
Reactome pathway
n/an/an/an/a 1n/an/an/an/a
University of Copenhagen
Curated by ChEMBL
Assay Description
Agonist activity at human NPYY2 receptor expressed in HEK293 cells assessed as decrease in isoproterenol-induced cAMP level measured every 30 secs fo...
ACS Med Chem Lett 4: 1228-32 (2013)
Article DOI: 10.1021/ml400335g
BindingDB Entry DOI: 10.7270/Q28S4RD1
Neuropeptide Y receptor type 5 ( NPY Y5)
(Homo sapiens (Human))
BDBM50197025
(CHEMBL439904 | PYY(3-36))
Show SMILES CC[C@H](C)[C@H](N)C(=O)N[C@@H](CCCCN)C(=O)N1CCC[C@H]1C(=O)N[C@@H](CCC(O)=O)C(=O)N[C@@H](C)C(=O)N1CCC[C@H]1C(=O)NCC(=O)N[C@@H](CCC(O)=O)C(=O)N[C@@H](CC(O)=O)C(=O)N[C@@H](C)C(=O)N[C@@H](CO)C(=O)N1CCC[C@H]1C(=O)N[C@@H](CCC(O)=O)C(=O)N[C@@H](CCC(O)=O)C(=O)N[C@@H](CC(C)C)C(=O)N[C@@H](CC(N)=O)C(=O)N[C@@H](CCCNC(N)=N)C(=O)N[C@@H](Cc1ccc(O)cc1)C(=O)N[C@@H](Cc1ccc(O)cc1)C(=O)N[C@@H](C)C(=O)N[C@@H](CO)C(=O)N[C@@H](CC(C)C)C(=O)N[C@@H](CCCNC(N)=N)C(=O)N[C@@H](Cc1cnc[nH]1)C(=O)N[C@@H](Cc1ccc(O)cc1)C(=O)N[C@@H](CC(C)C)C(=O)N[C@@H](CC(N)=O)C(=O)N[C@@H](CC(C)C)C(=O)N[C@@H](C(C)C)C(=O)N[C@@H]([C@@H](C)O)C(=O)N[C@@H](CCCNC(N)=N)C(=O)N[C@@H](CCC(N)=O)C(=O)N[C@@H](CCCNC(N)=N)C(=O)N[C@@H](Cc1ccc(O)cc1)C(N)=O
Show InChI InChI=1S/C180H279N53O54/c1-17-91(12)141(185)171(282)214-114(27-18-19-61-181)175(286)232-67-25-33-130(232)169(280)211-111(53-58-137(247)248)147(258)204-94(15)174(285)231-66-24-32-129(231)168(279)200-82-135(244)205-109(52-57-136(245)246)152(263)226-126(80-140(253)254)157(268)203-93(14)146(257)228-128(84-235)176(287)233-68-26-34-131(233)170(281)212-113(55-60-139(251)252)154(265)210-112(54-59-138(249)250)155(266)216-117(70-87(4)5)159(270)224-124(78-133(183)242)164(275)208-106(29-21-63-197-178(189)190)150(261)220-121(75-98-39-47-103(239)48-40-98)162(273)221-120(74-97-37-45-102(238)46-38-97)156(267)202-92(13)145(256)227-127(83-234)167(278)219-116(69-86(2)3)158(269)207-107(30-22-64-198-179(191)192)151(262)223-123(77-100-81-195-85-201-100)163(274)222-122(76-99-41-49-104(240)50-42-99)161(272)217-118(71-88(6)7)160(271)225-125(79-134(184)243)165(276)218-119(72-89(8)9)166(277)229-142(90(10)11)172(283)230-143(95(16)236)173(284)213-108(31-23-65-199-180(193)194)148(259)209-110(51-56-132(182)241)153(264)206-105(28-20-62-196-177(187)188)149(260)215-115(144(186)255)73-96-35-43-101(237)44-36-96/h35-50,81,85-95,105-131,141-143,234-240H,17-34,51-80,82-84,181,185H2,1-16H3,(H2,182,241)(H2,183,242)(H2,184,243)(H2,186,255)(H,195,201)(H,200,279)(H,202,267)(H,203,268)(H,204,258)(H,205,244)(H,206,264)(H,207,269)(H,208,275)(H,209,259)(H,210,265)(H,211,280)(H,212,281)(H,213,284)(H,214,282)(H,215,260)(H,216,266)(H,217,272)(H,218,276)(H,219,278)(H,220,261)(H,221,273)(H,222,274)(H,223,262)(H,224,270)(H,225,271)(H,226,263)(H,227,256)(H,228,257)(H,229,277)(H,230,283)(H,245,246)(H,247,248)(H,249,250)(H,251,252)(H,253,254)(H4,187,188,196)(H4,189,190,197)(H4,191,192,198)(H4,193,194,199)/t91-,92-,93-,94-,95+,105-,106-,107-,108-,109-,110-,111-,112-,113-,114-,115-,116-,117-,118-,119-,120-,121-,122-,123-,124-,125-,126-,127-,128-,129-,130-,131-,141-,142-,143-/m0/s1
n/an/an/an/a 8.20n/an/an/an/a
University of Copenhagen
Curated by ChEMBL
Assay Description
Agonist activity at human NPYY5 receptor expressed in HEK293 cells assessed as decrease in isoproterenol-induced cAMP level measured every 30 secs fo...
ACS Med Chem Lett 4: 1228-32 (2013)
Article DOI: 10.1021/ml400335g
BindingDB Entry DOI: 10.7270/Q28S4RD1
Neuropeptide Y receptor type 2
(Homo sapiens (Human))
BDBM50197025
(CHEMBL439904 | PYY(3-36))
Show SMILES CC[C@H](C)[C@H](N)C(=O)N[C@@H](CCCCN)C(=O)N1CCC[C@H]1C(=O)N[C@@H](CCC(O)=O)C(=O)N[C@@H](C)C(=O)N1CCC[C@H]1C(=O)NCC(=O)N[C@@H](CCC(O)=O)C(=O)N[C@@H](CC(O)=O)C(=O)N[C@@H](C)C(=O)N[C@@H](CO)C(=O)N1CCC[C@H]1C(=O)N[C@@H](CCC(O)=O)C(=O)N[C@@H](CCC(O)=O)C(=O)N[C@@H](CC(C)C)C(=O)N[C@@H](CC(N)=O)C(=O)N[C@@H](CCCNC(N)=N)C(=O)N[C@@H](Cc1ccc(O)cc1)C(=O)N[C@@H](Cc1ccc(O)cc1)C(=O)N[C@@H](C)C(=O)N[C@@H](CO)C(=O)N[C@@H](CC(C)C)C(=O)N[C@@H](CCCNC(N)=N)C(=O)N[C@@H](Cc1cnc[nH]1)C(=O)N[C@@H](Cc1ccc(O)cc1)C(=O)N[C@@H](CC(C)C)C(=O)N[C@@H](CC(N)=O)C(=O)N[C@@H](CC(C)C)C(=O)N[C@@H](C(C)C)C(=O)N[C@@H]([C@@H](C)O)C(=O)N[C@@H](CCCNC(N)=N)C(=O)N[C@@H](CCC(N)=O)C(=O)N[C@@H](CCCNC(N)=N)C(=O)N[C@@H](Cc1ccc(O)cc1)C(N)=O
Show InChI InChI=1S/C180H279N53O54/c1-17-91(12)141(185)171(282)214-114(27-18-19-61-181)175(286)232-67-25-33-130(232)169(280)211-111(53-58-137(247)248)147(258)204-94(15)174(285)231-66-24-32-129(231)168(279)200-82-135(244)205-109(52-57-136(245)246)152(263)226-126(80-140(253)254)157(268)203-93(14)146(257)228-128(84-235)176(287)233-68-26-34-131(233)170(281)212-113(55-60-139(251)252)154(265)210-112(54-59-138(249)250)155(266)216-117(70-87(4)5)159(270)224-124(78-133(183)242)164(275)208-106(29-21-63-197-178(189)190)150(261)220-121(75-98-39-47-103(239)48-40-98)162(273)221-120(74-97-37-45-102(238)46-38-97)156(267)202-92(13)145(256)227-127(83-234)167(278)219-116(69-86(2)3)158(269)207-107(30-22-64-198-179(191)192)151(262)223-123(77-100-81-195-85-201-100)163(274)222-122(76-99-41-49-104(240)50-42-99)161(272)217-118(71-88(6)7)160(271)225-125(79-134(184)243)165(276)218-119(72-89(8)9)166(277)229-142(90(10)11)172(283)230-143(95(16)236)173(284)213-108(31-23-65-199-180(193)194)148(259)209-110(51-56-132(182)241)153(264)206-105(28-20-62-196-177(187)188)149(260)215-115(144(186)255)73-96-35-43-101(237)44-36-96/h35-50,81,85-95,105-131,141-143,234-240H,17-34,51-80,82-84,181,185H2,1-16H3,(H2,182,241)(H2,183,242)(H2,184,243)(H2,186,255)(H,195,201)(H,200,279)(H,202,267)(H,203,268)(H,204,258)(H,205,244)(H,206,264)(H,207,269)(H,208,275)(H,209,259)(H,210,265)(H,211,280)(H,212,281)(H,213,284)(H,214,282)(H,215,260)(H,216,266)(H,217,272)(H,218,276)(H,219,278)(H,220,261)(H,221,273)(H,222,274)(H,223,262)(H,224,270)(H,225,271)(H,226,263)(H,227,256)(H,228,257)(H,229,277)(H,230,283)(H,245,246)(H,247,248)(H,249,250)(H,251,252)(H,253,254)(H4,187,188,196)(H4,189,190,197)(H4,191,192,198)(H4,193,194,199)/t91-,92-,93-,94-,95+,105-,106-,107-,108-,109-,110-,111-,112-,113-,114-,115-,116-,117-,118-,119-,120-,121-,122-,123-,124-,125-,126-,127-,128-,129-,130-,131-,141-,142-,143-/m0/s1
Reactome pathway
n/an/an/an/a 0.280n/an/an/an/a
Takeda Pharmaceutical Company, Ltd.
Curated by ChEMBL
Assay Description
Agonist activity at human Y2 receptor expressed in CHO cell membranes after 120 mins by [35S]GTPgammaS binding assay
Bioorg Med Chem Lett 27: 3829-3832 (2017)
Article DOI: 10.1016/j.bmcl.2017.06.055
BindingDB Entry DOI: 10.7270/Q2MK6GC2
Neuropeptide Y receptor type 2
(Homo sapiens (Human))
BDBM50197025
(CHEMBL439904 | PYY(3-36))
Show SMILES CC[C@H](C)[C@H](N)C(=O)N[C@@H](CCCCN)C(=O)N1CCC[C@H]1C(=O)N[C@@H](CCC(O)=O)C(=O)N[C@@H](C)C(=O)N1CCC[C@H]1C(=O)NCC(=O)N[C@@H](CCC(O)=O)C(=O)N[C@@H](CC(O)=O)C(=O)N[C@@H](C)C(=O)N[C@@H](CO)C(=O)N1CCC[C@H]1C(=O)N[C@@H](CCC(O)=O)C(=O)N[C@@H](CCC(O)=O)C(=O)N[C@@H](CC(C)C)C(=O)N[C@@H](CC(N)=O)C(=O)N[C@@H](CCCNC(N)=N)C(=O)N[C@@H](Cc1ccc(O)cc1)C(=O)N[C@@H](Cc1ccc(O)cc1)C(=O)N[C@@H](C)C(=O)N[C@@H](CO)C(=O)N[C@@H](CC(C)C)C(=O)N[C@@H](CCCNC(N)=N)C(=O)N[C@@H](Cc1cnc[nH]1)C(=O)N[C@@H](Cc1ccc(O)cc1)C(=O)N[C@@H](CC(C)C)C(=O)N[C@@H](CC(N)=O)C(=O)N[C@@H](CC(C)C)C(=O)N[C@@H](C(C)C)C(=O)N[C@@H]([C@@H](C)O)C(=O)N[C@@H](CCCNC(N)=N)C(=O)N[C@@H](CCC(N)=O)C(=O)N[C@@H](CCCNC(N)=N)C(=O)N[C@@H](Cc1ccc(O)cc1)C(N)=O
Show InChI InChI=1S/C180H279N53O54/c1-17-91(12)141(185)171(282)214-114(27-18-19-61-181)175(286)232-67-25-33-130(232)169(280)211-111(53-58-137(247)248)147(258)204-94(15)174(285)231-66-24-32-129(231)168(279)200-82-135(244)205-109(52-57-136(245)246)152(263)226-126(80-140(253)254)157(268)203-93(14)146(257)228-128(84-235)176(287)233-68-26-34-131(233)170(281)212-113(55-60-139(251)252)154(265)210-112(54-59-138(249)250)155(266)216-117(70-87(4)5)159(270)224-124(78-133(183)242)164(275)208-106(29-21-63-197-178(189)190)150(261)220-121(75-98-39-47-103(239)48-40-98)162(273)221-120(74-97-37-45-102(238)46-38-97)156(267)202-92(13)145(256)227-127(83-234)167(278)219-116(69-86(2)3)158(269)207-107(30-22-64-198-179(191)192)151(262)223-123(77-100-81-195-85-201-100)163(274)222-122(76-99-41-49-104(240)50-42-99)161(272)217-118(71-88(6)7)160(271)225-125(79-134(184)243)165(276)218-119(72-89(8)9)166(277)229-142(90(10)11)172(283)230-143(95(16)236)173(284)213-108(31-23-65-199-180(193)194)148(259)209-110(51-56-132(182)241)153(264)206-105(28-20-62-196-177(187)188)149(260)215-115(144(186)255)73-96-35-43-101(237)44-36-96/h35-50,81,85-95,105-131,141-143,234-240H,17-34,51-80,82-84,181,185H2,1-16H3,(H2,182,241)(H2,183,242)(H2,184,243)(H2,186,255)(H,195,201)(H,200,279)(H,202,267)(H,203,268)(H,204,258)(H,205,244)(H,206,264)(H,207,269)(H,208,275)(H,209,259)(H,210,265)(H,211,280)(H,212,281)(H,213,284)(H,214,282)(H,215,260)(H,216,266)(H,217,272)(H,218,276)(H,219,278)(H,220,261)(H,221,273)(H,222,274)(H,223,262)(H,224,270)(H,225,271)(H,226,263)(H,227,256)(H,228,257)(H,229,277)(H,230,283)(H,245,246)(H,247,248)(H,249,250)(H,251,252)(H,253,254)(H4,187,188,196)(H4,189,190,197)(H4,191,192,198)(H4,193,194,199)/t91-,92-,93-,94-,95+,105-,106-,107-,108-,109-,110-,111-,112-,113-,114-,115-,116-,117-,118-,119-,120-,121-,122-,123-,124-,125-,126-,127-,128-,129-,130-,131-,141-,142-,143-/m0/s1
Reactome pathway
n/an/an/an/a 1n/an/an/an/a
TBA
Citation and Details
Neuropeptide Y receptor type 2
(Homo sapiens (Human))
BDBM50197025
(CHEMBL439904 | PYY(3-36))
Show SMILES CC[C@H](C)[C@H](N)C(=O)N[C@@H](CCCCN)C(=O)N1CCC[C@H]1C(=O)N[C@@H](CCC(O)=O)C(=O)N[C@@H](C)C(=O)N1CCC[C@H]1C(=O)NCC(=O)N[C@@H](CCC(O)=O)C(=O)N[C@@H](CC(O)=O)C(=O)N[C@@H](C)C(=O)N[C@@H](CO)C(=O)N1CCC[C@H]1C(=O)N[C@@H](CCC(O)=O)C(=O)N[C@@H](CCC(O)=O)C(=O)N[C@@H](CC(C)C)C(=O)N[C@@H](CC(N)=O)C(=O)N[C@@H](CCCNC(N)=N)C(=O)N[C@@H](Cc1ccc(O)cc1)C(=O)N[C@@H](Cc1ccc(O)cc1)C(=O)N[C@@H](C)C(=O)N[C@@H](CO)C(=O)N[C@@H](CC(C)C)C(=O)N[C@@H](CCCNC(N)=N)C(=O)N[C@@H](Cc1cnc[nH]1)C(=O)N[C@@H](Cc1ccc(O)cc1)C(=O)N[C@@H](CC(C)C)C(=O)N[C@@H](CC(N)=O)C(=O)N[C@@H](CC(C)C)C(=O)N[C@@H](C(C)C)C(=O)N[C@@H]([C@@H](C)O)C(=O)N[C@@H](CCCNC(N)=N)C(=O)N[C@@H](CCC(N)=O)C(=O)N[C@@H](CCCNC(N)=N)C(=O)N[C@@H](Cc1ccc(O)cc1)C(N)=O
Show InChI InChI=1S/C180H279N53O54/c1-17-91(12)141(185)171(282)214-114(27-18-19-61-181)175(286)232-67-25-33-130(232)169(280)211-111(53-58-137(247)248)147(258)204-94(15)174(285)231-66-24-32-129(231)168(279)200-82-135(244)205-109(52-57-136(245)246)152(263)226-126(80-140(253)254)157(268)203-93(14)146(257)228-128(84-235)176(287)233-68-26-34-131(233)170(281)212-113(55-60-139(251)252)154(265)210-112(54-59-138(249)250)155(266)216-117(70-87(4)5)159(270)224-124(78-133(183)242)164(275)208-106(29-21-63-197-178(189)190)150(261)220-121(75-98-39-47-103(239)48-40-98)162(273)221-120(74-97-37-45-102(238)46-38-97)156(267)202-92(13)145(256)227-127(83-234)167(278)219-116(69-86(2)3)158(269)207-107(30-22-64-198-179(191)192)151(262)223-123(77-100-81-195-85-201-100)163(274)222-122(76-99-41-49-104(240)50-42-99)161(272)217-118(71-88(6)7)160(271)225-125(79-134(184)243)165(276)218-119(72-89(8)9)166(277)229-142(90(10)11)172(283)230-143(95(16)236)173(284)213-108(31-23-65-199-180(193)194)148(259)209-110(51-56-132(182)241)153(264)206-105(28-20-62-196-177(187)188)149(260)215-115(144(186)255)73-96-35-43-101(237)44-36-96/h35-50,81,85-95,105-131,141-143,234-240H,17-34,51-80,82-84,181,185H2,1-16H3,(H2,182,241)(H2,183,242)(H2,184,243)(H2,186,255)(H,195,201)(H,200,279)(H,202,267)(H,203,268)(H,204,258)(H,205,244)(H,206,264)(H,207,269)(H,208,275)(H,209,259)(H,210,265)(H,211,280)(H,212,281)(H,213,284)(H,214,282)(H,215,260)(H,216,266)(H,217,272)(H,218,276)(H,219,278)(H,220,261)(H,221,273)(H,222,274)(H,223,262)(H,224,270)(H,225,271)(H,226,263)(H,227,256)(H,228,257)(H,229,277)(H,230,283)(H,245,246)(H,247,248)(H,249,250)(H,251,252)(H,253,254)(H4,187,188,196)(H4,189,190,197)(H4,191,192,198)(H4,193,194,199)/t91-,92-,93-,94-,95+,105-,106-,107-,108-,109-,110-,111-,112-,113-,114-,115-,116-,117-,118-,119-,120-,121-,122-,123-,124-,125-,126-,127-,128-,129-,130-,131-,141-,142-,143-/m0/s1
Reactome pathway
n/an/an/an/a 0.280n/an/an/an/a
Takeda Pharmaceutical Company, Ltd.
Curated by ChEMBL
Assay Description
Agonist activity at human neuropeptide Y2 receptor expressed in CHO cell membranes assessed as stimulation of [35S]GTPgammaS binding incubated for 12...
Bioorg Med Chem 25: 5718-5725 (2017)
Article DOI: 10.1016/j.bmc.2017.08.044
BindingDB Entry DOI: 10.7270/Q23X8969
Neuropeptide Y receptor type 2
(Homo sapiens (Human))
BDBM50197025
(CHEMBL439904 | PYY(3-36))
Show SMILES CC[C@H](C)[C@H](N)C(=O)N[C@@H](CCCCN)C(=O)N1CCC[C@H]1C(=O)N[C@@H](CCC(O)=O)C(=O)N[C@@H](C)C(=O)N1CCC[C@H]1C(=O)NCC(=O)N[C@@H](CCC(O)=O)C(=O)N[C@@H](CC(O)=O)C(=O)N[C@@H](C)C(=O)N[C@@H](CO)C(=O)N1CCC[C@H]1C(=O)N[C@@H](CCC(O)=O)C(=O)N[C@@H](CCC(O)=O)C(=O)N[C@@H](CC(C)C)C(=O)N[C@@H](CC(N)=O)C(=O)N[C@@H](CCCNC(N)=N)C(=O)N[C@@H](Cc1ccc(O)cc1)C(=O)N[C@@H](Cc1ccc(O)cc1)C(=O)N[C@@H](C)C(=O)N[C@@H](CO)C(=O)N[C@@H](CC(C)C)C(=O)N[C@@H](CCCNC(N)=N)C(=O)N[C@@H](Cc1cnc[nH]1)C(=O)N[C@@H](Cc1ccc(O)cc1)C(=O)N[C@@H](CC(C)C)C(=O)N[C@@H](CC(N)=O)C(=O)N[C@@H](CC(C)C)C(=O)N[C@@H](C(C)C)C(=O)N[C@@H]([C@@H](C)O)C(=O)N[C@@H](CCCNC(N)=N)C(=O)N[C@@H](CCC(N)=O)C(=O)N[C@@H](CCCNC(N)=N)C(=O)N[C@@H](Cc1ccc(O)cc1)C(N)=O
Show InChI InChI=1S/C180H279N53O54/c1-17-91(12)141(185)171(282)214-114(27-18-19-61-181)175(286)232-67-25-33-130(232)169(280)211-111(53-58-137(247)248)147(258)204-94(15)174(285)231-66-24-32-129(231)168(279)200-82-135(244)205-109(52-57-136(245)246)152(263)226-126(80-140(253)254)157(268)203-93(14)146(257)228-128(84-235)176(287)233-68-26-34-131(233)170(281)212-113(55-60-139(251)252)154(265)210-112(54-59-138(249)250)155(266)216-117(70-87(4)5)159(270)224-124(78-133(183)242)164(275)208-106(29-21-63-197-178(189)190)150(261)220-121(75-98-39-47-103(239)48-40-98)162(273)221-120(74-97-37-45-102(238)46-38-97)156(267)202-92(13)145(256)227-127(83-234)167(278)219-116(69-86(2)3)158(269)207-107(30-22-64-198-179(191)192)151(262)223-123(77-100-81-195-85-201-100)163(274)222-122(76-99-41-49-104(240)50-42-99)161(272)217-118(71-88(6)7)160(271)225-125(79-134(184)243)165(276)218-119(72-89(8)9)166(277)229-142(90(10)11)172(283)230-143(95(16)236)173(284)213-108(31-23-65-199-180(193)194)148(259)209-110(51-56-132(182)241)153(264)206-105(28-20-62-196-177(187)188)149(260)215-115(144(186)255)73-96-35-43-101(237)44-36-96/h35-50,81,85-95,105-131,141-143,234-240H,17-34,51-80,82-84,181,185H2,1-16H3,(H2,182,241)(H2,183,242)(H2,184,243)(H2,186,255)(H,195,201)(H,200,279)(H,202,267)(H,203,268)(H,204,258)(H,205,244)(H,206,264)(H,207,269)(H,208,275)(H,209,259)(H,210,265)(H,211,280)(H,212,281)(H,213,284)(H,214,282)(H,215,260)(H,216,266)(H,217,272)(H,218,276)(H,219,278)(H,220,261)(H,221,273)(H,222,274)(H,223,262)(H,224,270)(H,225,271)(H,226,263)(H,227,256)(H,228,257)(H,229,277)(H,230,283)(H,245,246)(H,247,248)(H,249,250)(H,251,252)(H,253,254)(H4,187,188,196)(H4,189,190,197)(H4,191,192,198)(H4,193,194,199)/t91-,92-,93-,94-,95+,105-,106-,107-,108-,109-,110-,111-,112-,113-,114-,115-,116-,117-,118-,119-,120-,121-,122-,123-,124-,125-,126-,127-,128-,129-,130-,131-,141-,142-,143-/m0/s1
Reactome pathway
n/an/a 0.570n/an/an/an/an/an/a
Takeda Pharmaceutical Company, Ltd.
Curated by ChEMBL
Assay Description
Displacement of [125I]-PYY from human neuropeptide Y2 receptor expressed in CHO cell membranes incubated for 60 mins by TopCount based method
Bioorg Med Chem 25: 5718-5725 (2017)
Article DOI: 10.1016/j.bmc.2017.08.044
BindingDB Entry DOI: 10.7270/Q23X8969
Neuropeptide Y receptor type 2
(Homo sapiens (Human))
BDBM50197025
(CHEMBL439904 | PYY(3-36))
Show SMILES CC[C@H](C)[C@H](N)C(=O)N[C@@H](CCCCN)C(=O)N1CCC[C@H]1C(=O)N[C@@H](CCC(O)=O)C(=O)N[C@@H](C)C(=O)N1CCC[C@H]1C(=O)NCC(=O)N[C@@H](CCC(O)=O)C(=O)N[C@@H](CC(O)=O)C(=O)N[C@@H](C)C(=O)N[C@@H](CO)C(=O)N1CCC[C@H]1C(=O)N[C@@H](CCC(O)=O)C(=O)N[C@@H](CCC(O)=O)C(=O)N[C@@H](CC(C)C)C(=O)N[C@@H](CC(N)=O)C(=O)N[C@@H](CCCNC(N)=N)C(=O)N[C@@H](Cc1ccc(O)cc1)C(=O)N[C@@H](Cc1ccc(O)cc1)C(=O)N[C@@H](C)C(=O)N[C@@H](CO)C(=O)N[C@@H](CC(C)C)C(=O)N[C@@H](CCCNC(N)=N)C(=O)N[C@@H](Cc1cnc[nH]1)C(=O)N[C@@H](Cc1ccc(O)cc1)C(=O)N[C@@H](CC(C)C)C(=O)N[C@@H](CC(N)=O)C(=O)N[C@@H](CC(C)C)C(=O)N[C@@H](C(C)C)C(=O)N[C@@H]([C@@H](C)O)C(=O)N[C@@H](CCCNC(N)=N)C(=O)N[C@@H](CCC(N)=O)C(=O)N[C@@H](CCCNC(N)=N)C(=O)N[C@@H](Cc1ccc(O)cc1)C(N)=O
Show InChI InChI=1S/C180H279N53O54/c1-17-91(12)141(185)171(282)214-114(27-18-19-61-181)175(286)232-67-25-33-130(232)169(280)211-111(53-58-137(247)248)147(258)204-94(15)174(285)231-66-24-32-129(231)168(279)200-82-135(244)205-109(52-57-136(245)246)152(263)226-126(80-140(253)254)157(268)203-93(14)146(257)228-128(84-235)176(287)233-68-26-34-131(233)170(281)212-113(55-60-139(251)252)154(265)210-112(54-59-138(249)250)155(266)216-117(70-87(4)5)159(270)224-124(78-133(183)242)164(275)208-106(29-21-63-197-178(189)190)150(261)220-121(75-98-39-47-103(239)48-40-98)162(273)221-120(74-97-37-45-102(238)46-38-97)156(267)202-92(13)145(256)227-127(83-234)167(278)219-116(69-86(2)3)158(269)207-107(30-22-64-198-179(191)192)151(262)223-123(77-100-81-195-85-201-100)163(274)222-122(76-99-41-49-104(240)50-42-99)161(272)217-118(71-88(6)7)160(271)225-125(79-134(184)243)165(276)218-119(72-89(8)9)166(277)229-142(90(10)11)172(283)230-143(95(16)236)173(284)213-108(31-23-65-199-180(193)194)148(259)209-110(51-56-132(182)241)153(264)206-105(28-20-62-196-177(187)188)149(260)215-115(144(186)255)73-96-35-43-101(237)44-36-96/h35-50,81,85-95,105-131,141-143,234-240H,17-34,51-80,82-84,181,185H2,1-16H3,(H2,182,241)(H2,183,242)(H2,184,243)(H2,186,255)(H,195,201)(H,200,279)(H,202,267)(H,203,268)(H,204,258)(H,205,244)(H,206,264)(H,207,269)(H,208,275)(H,209,259)(H,210,265)(H,211,280)(H,212,281)(H,213,284)(H,214,282)(H,215,260)(H,216,266)(H,217,272)(H,218,276)(H,219,278)(H,220,261)(H,221,273)(H,222,274)(H,223,262)(H,224,270)(H,225,271)(H,226,263)(H,227,256)(H,228,257)(H,229,277)(H,230,283)(H,245,246)(H,247,248)(H,249,250)(H,251,252)(H,253,254)(H4,187,188,196)(H4,189,190,197)(H4,191,192,198)(H4,193,194,199)/t91-,92-,93-,94-,95+,105-,106-,107-,108-,109-,110-,111-,112-,113-,114-,115-,116-,117-,118-,119-,120-,121-,122-,123-,124-,125-,126-,127-,128-,129-,130-,131-,141-,142-,143-/m0/s1
Reactome pathway
n/an/a 16n/an/an/an/an/an/a
TBA
Citation and Details
Neuropeptide Y receptor type 5
(Homo sapiens (Human))
BDBM50197025
(CHEMBL439904 | PYY(3-36))
Show SMILES CC[C@H](C)[C@H](N)C(=O)N[C@@H](CCCCN)C(=O)N1CCC[C@H]1C(=O)N[C@@H](CCC(O)=O)C(=O)N[C@@H](C)C(=O)N1CCC[C@H]1C(=O)NCC(=O)N[C@@H](CCC(O)=O)C(=O)N[C@@H](CC(O)=O)C(=O)N[C@@H](C)C(=O)N[C@@H](CO)C(=O)N1CCC[C@H]1C(=O)N[C@@H](CCC(O)=O)C(=O)N[C@@H](CCC(O)=O)C(=O)N[C@@H](CC(C)C)C(=O)N[C@@H](CC(N)=O)C(=O)N[C@@H](CCCNC(N)=N)C(=O)N[C@@H](Cc1ccc(O)cc1)C(=O)N[C@@H](Cc1ccc(O)cc1)C(=O)N[C@@H](C)C(=O)N[C@@H](CO)C(=O)N[C@@H](CC(C)C)C(=O)N[C@@H](CCCNC(N)=N)C(=O)N[C@@H](Cc1cnc[nH]1)C(=O)N[C@@H](Cc1ccc(O)cc1)C(=O)N[C@@H](CC(C)C)C(=O)N[C@@H](CC(N)=O)C(=O)N[C@@H](CC(C)C)C(=O)N[C@@H](C(C)C)C(=O)N[C@@H]([C@@H](C)O)C(=O)N[C@@H](CCCNC(N)=N)C(=O)N[C@@H](CCC(N)=O)C(=O)N[C@@H](CCCNC(N)=N)C(=O)N[C@@H](Cc1ccc(O)cc1)C(N)=O
Show InChI InChI=1S/C180H279N53O54/c1-17-91(12)141(185)171(282)214-114(27-18-19-61-181)175(286)232-67-25-33-130(232)169(280)211-111(53-58-137(247)248)147(258)204-94(15)174(285)231-66-24-32-129(231)168(279)200-82-135(244)205-109(52-57-136(245)246)152(263)226-126(80-140(253)254)157(268)203-93(14)146(257)228-128(84-235)176(287)233-68-26-34-131(233)170(281)212-113(55-60-139(251)252)154(265)210-112(54-59-138(249)250)155(266)216-117(70-87(4)5)159(270)224-124(78-133(183)242)164(275)208-106(29-21-63-197-178(189)190)150(261)220-121(75-98-39-47-103(239)48-40-98)162(273)221-120(74-97-37-45-102(238)46-38-97)156(267)202-92(13)145(256)227-127(83-234)167(278)219-116(69-86(2)3)158(269)207-107(30-22-64-198-179(191)192)151(262)223-123(77-100-81-195-85-201-100)163(274)222-122(76-99-41-49-104(240)50-42-99)161(272)217-118(71-88(6)7)160(271)225-125(79-134(184)243)165(276)218-119(72-89(8)9)166(277)229-142(90(10)11)172(283)230-143(95(16)236)173(284)213-108(31-23-65-199-180(193)194)148(259)209-110(51-56-132(182)241)153(264)206-105(28-20-62-196-177(187)188)149(260)215-115(144(186)255)73-96-35-43-101(237)44-36-96/h35-50,81,85-95,105-131,141-143,234-240H,17-34,51-80,82-84,181,185H2,1-16H3,(H2,182,241)(H2,183,242)(H2,184,243)(H2,186,255)(H,195,201)(H,200,279)(H,202,267)(H,203,268)(H,204,258)(H,205,244)(H,206,264)(H,207,269)(H,208,275)(H,209,259)(H,210,265)(H,211,280)(H,212,281)(H,213,284)(H,214,282)(H,215,260)(H,216,266)(H,217,272)(H,218,276)(H,219,278)(H,220,261)(H,221,273)(H,222,274)(H,223,262)(H,224,270)(H,225,271)(H,226,263)(H,227,256)(H,228,257)(H,229,277)(H,230,283)(H,245,246)(H,247,248)(H,249,250)(H,251,252)(H,253,254)(H4,187,188,196)(H4,189,190,197)(H4,191,192,198)(H4,193,194,199)/t91-,92-,93-,94-,95+,105-,106-,107-,108-,109-,110-,111-,112-,113-,114-,115-,116-,117-,118-,119-,120-,121-,122-,123-,124-,125-,126-,127-,128-,129-,130-,131-,141-,142-,143-/m0/s1
n/an/an/an/a 410n/an/an/an/a
TBA
Citation and Details
Neuropeptide Y receptor type 4
(Homo sapiens (Human))
BDBM50197025
(CHEMBL439904 | PYY(3-36))
Show SMILES CC[C@H](C)[C@H](N)C(=O)N[C@@H](CCCCN)C(=O)N1CCC[C@H]1C(=O)N[C@@H](CCC(O)=O)C(=O)N[C@@H](C)C(=O)N1CCC[C@H]1C(=O)NCC(=O)N[C@@H](CCC(O)=O)C(=O)N[C@@H](CC(O)=O)C(=O)N[C@@H](C)C(=O)N[C@@H](CO)C(=O)N1CCC[C@H]1C(=O)N[C@@H](CCC(O)=O)C(=O)N[C@@H](CCC(O)=O)C(=O)N[C@@H](CC(C)C)C(=O)N[C@@H](CC(N)=O)C(=O)N[C@@H](CCCNC(N)=N)C(=O)N[C@@H](Cc1ccc(O)cc1)C(=O)N[C@@H](Cc1ccc(O)cc1)C(=O)N[C@@H](C)C(=O)N[C@@H](CO)C(=O)N[C@@H](CC(C)C)C(=O)N[C@@H](CCCNC(N)=N)C(=O)N[C@@H](Cc1cnc[nH]1)C(=O)N[C@@H](Cc1ccc(O)cc1)C(=O)N[C@@H](CC(C)C)C(=O)N[C@@H](CC(N)=O)C(=O)N[C@@H](CC(C)C)C(=O)N[C@@H](C(C)C)C(=O)N[C@@H]([C@@H](C)O)C(=O)N[C@@H](CCCNC(N)=N)C(=O)N[C@@H](CCC(N)=O)C(=O)N[C@@H](CCCNC(N)=N)C(=O)N[C@@H](Cc1ccc(O)cc1)C(N)=O
Show InChI InChI=1S/C180H279N53O54/c1-17-91(12)141(185)171(282)214-114(27-18-19-61-181)175(286)232-67-25-33-130(232)169(280)211-111(53-58-137(247)248)147(258)204-94(15)174(285)231-66-24-32-129(231)168(279)200-82-135(244)205-109(52-57-136(245)246)152(263)226-126(80-140(253)254)157(268)203-93(14)146(257)228-128(84-235)176(287)233-68-26-34-131(233)170(281)212-113(55-60-139(251)252)154(265)210-112(54-59-138(249)250)155(266)216-117(70-87(4)5)159(270)224-124(78-133(183)242)164(275)208-106(29-21-63-197-178(189)190)150(261)220-121(75-98-39-47-103(239)48-40-98)162(273)221-120(74-97-37-45-102(238)46-38-97)156(267)202-92(13)145(256)227-127(83-234)167(278)219-116(69-86(2)3)158(269)207-107(30-22-64-198-179(191)192)151(262)223-123(77-100-81-195-85-201-100)163(274)222-122(76-99-41-49-104(240)50-42-99)161(272)217-118(71-88(6)7)160(271)225-125(79-134(184)243)165(276)218-119(72-89(8)9)166(277)229-142(90(10)11)172(283)230-143(95(16)236)173(284)213-108(31-23-65-199-180(193)194)148(259)209-110(51-56-132(182)241)153(264)206-105(28-20-62-196-177(187)188)149(260)215-115(144(186)255)73-96-35-43-101(237)44-36-96/h35-50,81,85-95,105-131,141-143,234-240H,17-34,51-80,82-84,181,185H2,1-16H3,(H2,182,241)(H2,183,242)(H2,184,243)(H2,186,255)(H,195,201)(H,200,279)(H,202,267)(H,203,268)(H,204,258)(H,205,244)(H,206,264)(H,207,269)(H,208,275)(H,209,259)(H,210,265)(H,211,280)(H,212,281)(H,213,284)(H,214,282)(H,215,260)(H,216,266)(H,217,272)(H,218,276)(H,219,278)(H,220,261)(H,221,273)(H,222,274)(H,223,262)(H,224,270)(H,225,271)(H,226,263)(H,227,256)(H,228,257)(H,229,277)(H,230,283)(H,245,246)(H,247,248)(H,249,250)(H,251,252)(H,253,254)(H4,187,188,196)(H4,189,190,197)(H4,191,192,198)(H4,193,194,199)/t91-,92-,93-,94-,95+,105-,106-,107-,108-,109-,110-,111-,112-,113-,114-,115-,116-,117-,118-,119-,120-,121-,122-,123-,124-,125-,126-,127-,128-,129-,130-,131-,141-,142-,143-/m0/s1
Reactome pathway
n/an/an/an/a 7.00E+3n/an/an/an/a
TBA
Citation and Details
Neuropeptide Y receptor type 1
(Homo sapiens (Human))
BDBM50197025
(CHEMBL439904 | PYY(3-36))
Show SMILES CC[C@H](C)[C@H](N)C(=O)N[C@@H](CCCCN)C(=O)N1CCC[C@H]1C(=O)N[C@@H](CCC(O)=O)C(=O)N[C@@H](C)C(=O)N1CCC[C@H]1C(=O)NCC(=O)N[C@@H](CCC(O)=O)C(=O)N[C@@H](CC(O)=O)C(=O)N[C@@H](C)C(=O)N[C@@H](CO)C(=O)N1CCC[C@H]1C(=O)N[C@@H](CCC(O)=O)C(=O)N[C@@H](CCC(O)=O)C(=O)N[C@@H](CC(C)C)C(=O)N[C@@H](CC(N)=O)C(=O)N[C@@H](CCCNC(N)=N)C(=O)N[C@@H](Cc1ccc(O)cc1)C(=O)N[C@@H](Cc1ccc(O)cc1)C(=O)N[C@@H](C)C(=O)N[C@@H](CO)C(=O)N[C@@H](CC(C)C)C(=O)N[C@@H](CCCNC(N)=N)C(=O)N[C@@H](Cc1cnc[nH]1)C(=O)N[C@@H](Cc1ccc(O)cc1)C(=O)N[C@@H](CC(C)C)C(=O)N[C@@H](CC(N)=O)C(=O)N[C@@H](CC(C)C)C(=O)N[C@@H](C(C)C)C(=O)N[C@@H]([C@@H](C)O)C(=O)N[C@@H](CCCNC(N)=N)C(=O)N[C@@H](CCC(N)=O)C(=O)N[C@@H](CCCNC(N)=N)C(=O)N[C@@H](Cc1ccc(O)cc1)C(N)=O
Show InChI InChI=1S/C180H279N53O54/c1-17-91(12)141(185)171(282)214-114(27-18-19-61-181)175(286)232-67-25-33-130(232)169(280)211-111(53-58-137(247)248)147(258)204-94(15)174(285)231-66-24-32-129(231)168(279)200-82-135(244)205-109(52-57-136(245)246)152(263)226-126(80-140(253)254)157(268)203-93(14)146(257)228-128(84-235)176(287)233-68-26-34-131(233)170(281)212-113(55-60-139(251)252)154(265)210-112(54-59-138(249)250)155(266)216-117(70-87(4)5)159(270)224-124(78-133(183)242)164(275)208-106(29-21-63-197-178(189)190)150(261)220-121(75-98-39-47-103(239)48-40-98)162(273)221-120(74-97-37-45-102(238)46-38-97)156(267)202-92(13)145(256)227-127(83-234)167(278)219-116(69-86(2)3)158(269)207-107(30-22-64-198-179(191)192)151(262)223-123(77-100-81-195-85-201-100)163(274)222-122(76-99-41-49-104(240)50-42-99)161(272)217-118(71-88(6)7)160(271)225-125(79-134(184)243)165(276)218-119(72-89(8)9)166(277)229-142(90(10)11)172(283)230-143(95(16)236)173(284)213-108(31-23-65-199-180(193)194)148(259)209-110(51-56-132(182)241)153(264)206-105(28-20-62-196-177(187)188)149(260)215-115(144(186)255)73-96-35-43-101(237)44-36-96/h35-50,81,85-95,105-131,141-143,234-240H,17-34,51-80,82-84,181,185H2,1-16H3,(H2,182,241)(H2,183,242)(H2,184,243)(H2,186,255)(H,195,201)(H,200,279)(H,202,267)(H,203,268)(H,204,258)(H,205,244)(H,206,264)(H,207,269)(H,208,275)(H,209,259)(H,210,265)(H,211,280)(H,212,281)(H,213,284)(H,214,282)(H,215,260)(H,216,266)(H,217,272)(H,218,276)(H,219,278)(H,220,261)(H,221,273)(H,222,274)(H,223,262)(H,224,270)(H,225,271)(H,226,263)(H,227,256)(H,228,257)(H,229,277)(H,230,283)(H,245,246)(H,247,248)(H,249,250)(H,251,252)(H,253,254)(H4,187,188,196)(H4,189,190,197)(H4,191,192,198)(H4,193,194,199)/t91-,92-,93-,94-,95+,105-,106-,107-,108-,109-,110-,111-,112-,113-,114-,115-,116-,117-,118-,119-,120-,121-,122-,123-,124-,125-,126-,127-,128-,129-,130-,131-,141-,142-,143-/m0/s1
Reactome pathway
n/an/an/an/a 2.00E+3n/an/an/an/a
TBA
Citation and Details
Neuropeptide Y receptor type 2
(Homo sapiens (Human))
BDBM50197025
(CHEMBL439904 | PYY(3-36))
Show SMILES CC[C@H](C)[C@H](N)C(=O)N[C@@H](CCCCN)C(=O)N1CCC[C@H]1C(=O)N[C@@H](CCC(O)=O)C(=O)N[C@@H](C)C(=O)N1CCC[C@H]1C(=O)NCC(=O)N[C@@H](CCC(O)=O)C(=O)N[C@@H](CC(O)=O)C(=O)N[C@@H](C)C(=O)N[C@@H](CO)C(=O)N1CCC[C@H]1C(=O)N[C@@H](CCC(O)=O)C(=O)N[C@@H](CCC(O)=O)C(=O)N[C@@H](CC(C)C)C(=O)N[C@@H](CC(N)=O)C(=O)N[C@@H](CCCNC(N)=N)C(=O)N[C@@H](Cc1ccc(O)cc1)C(=O)N[C@@H](Cc1ccc(O)cc1)C(=O)N[C@@H](C)C(=O)N[C@@H](CO)C(=O)N[C@@H](CC(C)C)C(=O)N[C@@H](CCCNC(N)=N)C(=O)N[C@@H](Cc1cnc[nH]1)C(=O)N[C@@H](Cc1ccc(O)cc1)C(=O)N[C@@H](CC(C)C)C(=O)N[C@@H](CC(N)=O)C(=O)N[C@@H](CC(C)C)C(=O)N[C@@H](C(C)C)C(=O)N[C@@H]([C@@H](C)O)C(=O)N[C@@H](CCCNC(N)=N)C(=O)N[C@@H](CCC(N)=O)C(=O)N[C@@H](CCCNC(N)=N)C(=O)N[C@@H](Cc1ccc(O)cc1)C(N)=O
Show InChI InChI=1S/C180H279N53O54/c1-17-91(12)141(185)171(282)214-114(27-18-19-61-181)175(286)232-67-25-33-130(232)169(280)211-111(53-58-137(247)248)147(258)204-94(15)174(285)231-66-24-32-129(231)168(279)200-82-135(244)205-109(52-57-136(245)246)152(263)226-126(80-140(253)254)157(268)203-93(14)146(257)228-128(84-235)176(287)233-68-26-34-131(233)170(281)212-113(55-60-139(251)252)154(265)210-112(54-59-138(249)250)155(266)216-117(70-87(4)5)159(270)224-124(78-133(183)242)164(275)208-106(29-21-63-197-178(189)190)150(261)220-121(75-98-39-47-103(239)48-40-98)162(273)221-120(74-97-37-45-102(238)46-38-97)156(267)202-92(13)145(256)227-127(83-234)167(278)219-116(69-86(2)3)158(269)207-107(30-22-64-198-179(191)192)151(262)223-123(77-100-81-195-85-201-100)163(274)222-122(76-99-41-49-104(240)50-42-99)161(272)217-118(71-88(6)7)160(271)225-125(79-134(184)243)165(276)218-119(72-89(8)9)166(277)229-142(90(10)11)172(283)230-143(95(16)236)173(284)213-108(31-23-65-199-180(193)194)148(259)209-110(51-56-132(182)241)153(264)206-105(28-20-62-196-177(187)188)149(260)215-115(144(186)255)73-96-35-43-101(237)44-36-96/h35-50,81,85-95,105-131,141-143,234-240H,17-34,51-80,82-84,181,185H2,1-16H3,(H2,182,241)(H2,183,242)(H2,184,243)(H2,186,255)(H,195,201)(H,200,279)(H,202,267)(H,203,268)(H,204,258)(H,205,244)(H,206,264)(H,207,269)(H,208,275)(H,209,259)(H,210,265)(H,211,280)(H,212,281)(H,213,284)(H,214,282)(H,215,260)(H,216,266)(H,217,272)(H,218,276)(H,219,278)(H,220,261)(H,221,273)(H,222,274)(H,223,262)(H,224,270)(H,225,271)(H,226,263)(H,227,256)(H,228,257)(H,229,277)(H,230,283)(H,245,246)(H,247,248)(H,249,250)(H,251,252)(H,253,254)(H4,187,188,196)(H4,189,190,197)(H4,191,192,198)(H4,193,194,199)/t91-,92-,93-,94-,95+,105-,106-,107-,108-,109-,110-,111-,112-,113-,114-,115-,116-,117-,118-,119-,120-,121-,122-,123-,124-,125-,126-,127-,128-,129-,130-,131-,141-,142-,143-/m0/s1
Reactome pathway
n/an/an/an/a 0.200n/an/an/an/a
TBA
Citation and Details
Neuropeptide Y receptor type 2
(Homo sapiens (Human))
BDBM50197025
(CHEMBL439904 | PYY(3-36))
Show SMILES CC[C@H](C)[C@H](N)C(=O)N[C@@H](CCCCN)C(=O)N1CCC[C@H]1C(=O)N[C@@H](CCC(O)=O)C(=O)N[C@@H](C)C(=O)N1CCC[C@H]1C(=O)NCC(=O)N[C@@H](CCC(O)=O)C(=O)N[C@@H](CC(O)=O)C(=O)N[C@@H](C)C(=O)N[C@@H](CO)C(=O)N1CCC[C@H]1C(=O)N[C@@H](CCC(O)=O)C(=O)N[C@@H](CCC(O)=O)C(=O)N[C@@H](CC(C)C)C(=O)N[C@@H](CC(N)=O)C(=O)N[C@@H](CCCNC(N)=N)C(=O)N[C@@H](Cc1ccc(O)cc1)C(=O)N[C@@H](Cc1ccc(O)cc1)C(=O)N[C@@H](C)C(=O)N[C@@H](CO)C(=O)N[C@@H](CC(C)C)C(=O)N[C@@H](CCCNC(N)=N)C(=O)N[C@@H](Cc1cnc[nH]1)C(=O)N[C@@H](Cc1ccc(O)cc1)C(=O)N[C@@H](CC(C)C)C(=O)N[C@@H](CC(N)=O)C(=O)N[C@@H](CC(C)C)C(=O)N[C@@H](C(C)C)C(=O)N[C@@H]([C@@H](C)O)C(=O)N[C@@H](CCCNC(N)=N)C(=O)N[C@@H](CCC(N)=O)C(=O)N[C@@H](CCCNC(N)=N)C(=O)N[C@@H](Cc1ccc(O)cc1)C(N)=O
Show InChI InChI=1S/C180H279N53O54/c1-17-91(12)141(185)171(282)214-114(27-18-19-61-181)175(286)232-67-25-33-130(232)169(280)211-111(53-58-137(247)248)147(258)204-94(15)174(285)231-66-24-32-129(231)168(279)200-82-135(244)205-109(52-57-136(245)246)152(263)226-126(80-140(253)254)157(268)203-93(14)146(257)228-128(84-235)176(287)233-68-26-34-131(233)170(281)212-113(55-60-139(251)252)154(265)210-112(54-59-138(249)250)155(266)216-117(70-87(4)5)159(270)224-124(78-133(183)242)164(275)208-106(29-21-63-197-178(189)190)150(261)220-121(75-98-39-47-103(239)48-40-98)162(273)221-120(74-97-37-45-102(238)46-38-97)156(267)202-92(13)145(256)227-127(83-234)167(278)219-116(69-86(2)3)158(269)207-107(30-22-64-198-179(191)192)151(262)223-123(77-100-81-195-85-201-100)163(274)222-122(76-99-41-49-104(240)50-42-99)161(272)217-118(71-88(6)7)160(271)225-125(79-134(184)243)165(276)218-119(72-89(8)9)166(277)229-142(90(10)11)172(283)230-143(95(16)236)173(284)213-108(31-23-65-199-180(193)194)148(259)209-110(51-56-132(182)241)153(264)206-105(28-20-62-196-177(187)188)149(260)215-115(144(186)255)73-96-35-43-101(237)44-36-96/h35-50,81,85-95,105-131,141-143,234-240H,17-34,51-80,82-84,181,185H2,1-16H3,(H2,182,241)(H2,183,242)(H2,184,243)(H2,186,255)(H,195,201)(H,200,279)(H,202,267)(H,203,268)(H,204,258)(H,205,244)(H,206,264)(H,207,269)(H,208,275)(H,209,259)(H,210,265)(H,211,280)(H,212,281)(H,213,284)(H,214,282)(H,215,260)(H,216,266)(H,217,272)(H,218,276)(H,219,278)(H,220,261)(H,221,273)(H,222,274)(H,223,262)(H,224,270)(H,225,271)(H,226,263)(H,227,256)(H,228,257)(H,229,277)(H,230,283)(H,245,246)(H,247,248)(H,249,250)(H,251,252)(H,253,254)(H4,187,188,196)(H4,189,190,197)(H4,191,192,198)(H4,193,194,199)/t91-,92-,93-,94-,95+,105-,106-,107-,108-,109-,110-,111-,112-,113-,114-,115-,116-,117-,118-,119-,120-,121-,122-,123-,124-,125-,126-,127-,128-,129-,130-,131-,141-,142-,143-/m0/s1
Reactome pathway
n/an/an/an/a 1.20n/an/an/an/a
TBA
Citation and Details
PPYR1
(Homo sapiens (Human))
BDBM50197025
(CHEMBL439904 | PYY(3-36))
Show SMILES CC[C@H](C)[C@H](N)C(=O)N[C@@H](CCCCN)C(=O)N1CCC[C@H]1C(=O)N[C@@H](CCC(O)=O)C(=O)N[C@@H](C)C(=O)N1CCC[C@H]1C(=O)NCC(=O)N[C@@H](CCC(O)=O)C(=O)N[C@@H](CC(O)=O)C(=O)N[C@@H](C)C(=O)N[C@@H](CO)C(=O)N1CCC[C@H]1C(=O)N[C@@H](CCC(O)=O)C(=O)N[C@@H](CCC(O)=O)C(=O)N[C@@H](CC(C)C)C(=O)N[C@@H](CC(N)=O)C(=O)N[C@@H](CCCNC(N)=N)C(=O)N[C@@H](Cc1ccc(O)cc1)C(=O)N[C@@H](Cc1ccc(O)cc1)C(=O)N[C@@H](C)C(=O)N[C@@H](CO)C(=O)N[C@@H](CC(C)C)C(=O)N[C@@H](CCCNC(N)=N)C(=O)N[C@@H](Cc1cnc[nH]1)C(=O)N[C@@H](Cc1ccc(O)cc1)C(=O)N[C@@H](CC(C)C)C(=O)N[C@@H](CC(N)=O)C(=O)N[C@@H](CC(C)C)C(=O)N[C@@H](C(C)C)C(=O)N[C@@H]([C@@H](C)O)C(=O)N[C@@H](CCCNC(N)=N)C(=O)N[C@@H](CCC(N)=O)C(=O)N[C@@H](CCCNC(N)=N)C(=O)N[C@@H](Cc1ccc(O)cc1)C(N)=O
Show InChI InChI=1S/C180H279N53O54/c1-17-91(12)141(185)171(282)214-114(27-18-19-61-181)175(286)232-67-25-33-130(232)169(280)211-111(53-58-137(247)248)147(258)204-94(15)174(285)231-66-24-32-129(231)168(279)200-82-135(244)205-109(52-57-136(245)246)152(263)226-126(80-140(253)254)157(268)203-93(14)146(257)228-128(84-235)176(287)233-68-26-34-131(233)170(281)212-113(55-60-139(251)252)154(265)210-112(54-59-138(249)250)155(266)216-117(70-87(4)5)159(270)224-124(78-133(183)242)164(275)208-106(29-21-63-197-178(189)190)150(261)220-121(75-98-39-47-103(239)48-40-98)162(273)221-120(74-97-37-45-102(238)46-38-97)156(267)202-92(13)145(256)227-127(83-234)167(278)219-116(69-86(2)3)158(269)207-107(30-22-64-198-179(191)192)151(262)223-123(77-100-81-195-85-201-100)163(274)222-122(76-99-41-49-104(240)50-42-99)161(272)217-118(71-88(6)7)160(271)225-125(79-134(184)243)165(276)218-119(72-89(8)9)166(277)229-142(90(10)11)172(283)230-143(95(16)236)173(284)213-108(31-23-65-199-180(193)194)148(259)209-110(51-56-132(182)241)153(264)206-105(28-20-62-196-177(187)188)149(260)215-115(144(186)255)73-96-35-43-101(237)44-36-96/h35-50,81,85-95,105-131,141-143,234-240H,17-34,51-80,82-84,181,185H2,1-16H3,(H2,182,241)(H2,183,242)(H2,184,243)(H2,186,255)(H,195,201)(H,200,279)(H,202,267)(H,203,268)(H,204,258)(H,205,244)(H,206,264)(H,207,269)(H,208,275)(H,209,259)(H,210,265)(H,211,280)(H,212,281)(H,213,284)(H,214,282)(H,215,260)(H,216,266)(H,217,272)(H,218,276)(H,219,278)(H,220,261)(H,221,273)(H,222,274)(H,223,262)(H,224,270)(H,225,271)(H,226,263)(H,227,256)(H,228,257)(H,229,277)(H,230,283)(H,245,246)(H,247,248)(H,249,250)(H,251,252)(H,253,254)(H4,187,188,196)(H4,189,190,197)(H4,191,192,198)(H4,193,194,199)/t91-,92-,93-,94-,95+,105-,106-,107-,108-,109-,110-,111-,112-,113-,114-,115-,116-,117-,118-,119-,120-,121-,122-,123-,124-,125-,126-,127-,128-,129-,130-,131-,141-,142-,143-/m0/s1
Reactome pathway
n/an/an/an/a 141n/an/an/an/a
University of Copenhagen
Curated by ChEMBL
Assay Description
Agonist activity at human NPYY4 receptor expressed in HEK293 cells assessed as decrease in isoproterenol-induced cAMP level measured every 30 secs fo...
ACS Med Chem Lett 4: 1228-32 (2013)
Article DOI: 10.1021/ml400335g
BindingDB Entry DOI: 10.7270/Q28S4RD1
Neuropeptide Y receptor type 1
(Homo sapiens (Human))
BDBM50197025
(CHEMBL439904 | PYY(3-36))
Show SMILES CC[C@H](C)[C@H](N)C(=O)N[C@@H](CCCCN)C(=O)N1CCC[C@H]1C(=O)N[C@@H](CCC(O)=O)C(=O)N[C@@H](C)C(=O)N1CCC[C@H]1C(=O)NCC(=O)N[C@@H](CCC(O)=O)C(=O)N[C@@H](CC(O)=O)C(=O)N[C@@H](C)C(=O)N[C@@H](CO)C(=O)N1CCC[C@H]1C(=O)N[C@@H](CCC(O)=O)C(=O)N[C@@H](CCC(O)=O)C(=O)N[C@@H](CC(C)C)C(=O)N[C@@H](CC(N)=O)C(=O)N[C@@H](CCCNC(N)=N)C(=O)N[C@@H](Cc1ccc(O)cc1)C(=O)N[C@@H](Cc1ccc(O)cc1)C(=O)N[C@@H](C)C(=O)N[C@@H](CO)C(=O)N[C@@H](CC(C)C)C(=O)N[C@@H](CCCNC(N)=N)C(=O)N[C@@H](Cc1cnc[nH]1)C(=O)N[C@@H](Cc1ccc(O)cc1)C(=O)N[C@@H](CC(C)C)C(=O)N[C@@H](CC(N)=O)C(=O)N[C@@H](CC(C)C)C(=O)N[C@@H](C(C)C)C(=O)N[C@@H]([C@@H](C)O)C(=O)N[C@@H](CCCNC(N)=N)C(=O)N[C@@H](CCC(N)=O)C(=O)N[C@@H](CCCNC(N)=N)C(=O)N[C@@H](Cc1ccc(O)cc1)C(N)=O
Show InChI InChI=1S/C180H279N53O54/c1-17-91(12)141(185)171(282)214-114(27-18-19-61-181)175(286)232-67-25-33-130(232)169(280)211-111(53-58-137(247)248)147(258)204-94(15)174(285)231-66-24-32-129(231)168(279)200-82-135(244)205-109(52-57-136(245)246)152(263)226-126(80-140(253)254)157(268)203-93(14)146(257)228-128(84-235)176(287)233-68-26-34-131(233)170(281)212-113(55-60-139(251)252)154(265)210-112(54-59-138(249)250)155(266)216-117(70-87(4)5)159(270)224-124(78-133(183)242)164(275)208-106(29-21-63-197-178(189)190)150(261)220-121(75-98-39-47-103(239)48-40-98)162(273)221-120(74-97-37-45-102(238)46-38-97)156(267)202-92(13)145(256)227-127(83-234)167(278)219-116(69-86(2)3)158(269)207-107(30-22-64-198-179(191)192)151(262)223-123(77-100-81-195-85-201-100)163(274)222-122(76-99-41-49-104(240)50-42-99)161(272)217-118(71-88(6)7)160(271)225-125(79-134(184)243)165(276)218-119(72-89(8)9)166(277)229-142(90(10)11)172(283)230-143(95(16)236)173(284)213-108(31-23-65-199-180(193)194)148(259)209-110(51-56-132(182)241)153(264)206-105(28-20-62-196-177(187)188)149(260)215-115(144(186)255)73-96-35-43-101(237)44-36-96/h35-50,81,85-95,105-131,141-143,234-240H,17-34,51-80,82-84,181,185H2,1-16H3,(H2,182,241)(H2,183,242)(H2,184,243)(H2,186,255)(H,195,201)(H,200,279)(H,202,267)(H,203,268)(H,204,258)(H,205,244)(H,206,264)(H,207,269)(H,208,275)(H,209,259)(H,210,265)(H,211,280)(H,212,281)(H,213,284)(H,214,282)(H,215,260)(H,216,266)(H,217,272)(H,218,276)(H,219,278)(H,220,261)(H,221,273)(H,222,274)(H,223,262)(H,224,270)(H,225,271)(H,226,263)(H,227,256)(H,228,257)(H,229,277)(H,230,283)(H,245,246)(H,247,248)(H,249,250)(H,251,252)(H,253,254)(H4,187,188,196)(H4,189,190,197)(H4,191,192,198)(H4,193,194,199)/t91-,92-,93-,94-,95+,105-,106-,107-,108-,109-,110-,111-,112-,113-,114-,115-,116-,117-,118-,119-,120-,121-,122-,123-,124-,125-,126-,127-,128-,129-,130-,131-,141-,142-,143-/m0/s1
Reactome pathway
n/an/an/an/a 5.60n/an/an/an/a
University of Copenhagen
Curated by ChEMBL
Assay Description
Agonist activity at human NPYY1 receptor expressed in HEK293 cells assessed as decrease in isoproterenol-induced cAMP level measured every 30 secs fo...
ACS Med Chem Lett 4: 1228-32 (2013)
Article DOI: 10.1021/ml400335g
BindingDB Entry DOI: 10.7270/Q28S4RD1
Neuropeptide Y receptor type 2
(Homo sapiens (Human))
BDBM50197025
(CHEMBL439904 | PYY(3-36))
Show SMILES CC[C@H](C)[C@H](N)C(=O)N[C@@H](CCCCN)C(=O)N1CCC[C@H]1C(=O)N[C@@H](CCC(O)=O)C(=O)N[C@@H](C)C(=O)N1CCC[C@H]1C(=O)NCC(=O)N[C@@H](CCC(O)=O)C(=O)N[C@@H](CC(O)=O)C(=O)N[C@@H](C)C(=O)N[C@@H](CO)C(=O)N1CCC[C@H]1C(=O)N[C@@H](CCC(O)=O)C(=O)N[C@@H](CCC(O)=O)C(=O)N[C@@H](CC(C)C)C(=O)N[C@@H](CC(N)=O)C(=O)N[C@@H](CCCNC(N)=N)C(=O)N[C@@H](Cc1ccc(O)cc1)C(=O)N[C@@H](Cc1ccc(O)cc1)C(=O)N[C@@H](C)C(=O)N[C@@H](CO)C(=O)N[C@@H](CC(C)C)C(=O)N[C@@H](CCCNC(N)=N)C(=O)N[C@@H](Cc1cnc[nH]1)C(=O)N[C@@H](Cc1ccc(O)cc1)C(=O)N[C@@H](CC(C)C)C(=O)N[C@@H](CC(N)=O)C(=O)N[C@@H](CC(C)C)C(=O)N[C@@H](C(C)C)C(=O)N[C@@H]([C@@H](C)O)C(=O)N[C@@H](CCCNC(N)=N)C(=O)N[C@@H](CCC(N)=O)C(=O)N[C@@H](CCCNC(N)=N)C(=O)N[C@@H](Cc1ccc(O)cc1)C(N)=O
Show InChI InChI=1S/C180H279N53O54/c1-17-91(12)141(185)171(282)214-114(27-18-19-61-181)175(286)232-67-25-33-130(232)169(280)211-111(53-58-137(247)248)147(258)204-94(15)174(285)231-66-24-32-129(231)168(279)200-82-135(244)205-109(52-57-136(245)246)152(263)226-126(80-140(253)254)157(268)203-93(14)146(257)228-128(84-235)176(287)233-68-26-34-131(233)170(281)212-113(55-60-139(251)252)154(265)210-112(54-59-138(249)250)155(266)216-117(70-87(4)5)159(270)224-124(78-133(183)242)164(275)208-106(29-21-63-197-178(189)190)150(261)220-121(75-98-39-47-103(239)48-40-98)162(273)221-120(74-97-37-45-102(238)46-38-97)156(267)202-92(13)145(256)227-127(83-234)167(278)219-116(69-86(2)3)158(269)207-107(30-22-64-198-179(191)192)151(262)223-123(77-100-81-195-85-201-100)163(274)222-122(76-99-41-49-104(240)50-42-99)161(272)217-118(71-88(6)7)160(271)225-125(79-134(184)243)165(276)218-119(72-89(8)9)166(277)229-142(90(10)11)172(283)230-143(95(16)236)173(284)213-108(31-23-65-199-180(193)194)148(259)209-110(51-56-132(182)241)153(264)206-105(28-20-62-196-177(187)188)149(260)215-115(144(186)255)73-96-35-43-101(237)44-36-96/h35-50,81,85-95,105-131,141-143,234-240H,17-34,51-80,82-84,181,185H2,1-16H3,(H2,182,241)(H2,183,242)(H2,184,243)(H2,186,255)(H,195,201)(H,200,279)(H,202,267)(H,203,268)(H,204,258)(H,205,244)(H,206,264)(H,207,269)(H,208,275)(H,209,259)(H,210,265)(H,211,280)(H,212,281)(H,213,284)(H,214,282)(H,215,260)(H,216,266)(H,217,272)(H,218,276)(H,219,278)(H,220,261)(H,221,273)(H,222,274)(H,223,262)(H,224,270)(H,225,271)(H,226,263)(H,227,256)(H,228,257)(H,229,277)(H,230,283)(H,245,246)(H,247,248)(H,249,250)(H,251,252)(H,253,254)(H4,187,188,196)(H4,189,190,197)(H4,191,192,198)(H4,193,194,199)/t91-,92-,93-,94-,95+,105-,106-,107-,108-,109-,110-,111-,112-,113-,114-,115-,116-,117-,118-,119-,120-,121-,122-,123-,124-,125-,126-,127-,128-,129-,130-,131-,141-,142-,143-/m0/s1
Reactome pathway
n/an/an/an/a 0.300n/an/an/an/a
Bayer Pharmaceuticals Corporation
Curated by ChEMBL
Assay Description
Agonist activity at human NPY2 receptor expressed in human KAN-TS cells by [35S]GTPgammaS incorporation assay
Bioorg Med Chem Lett 17: 538-41 (2007)
Article DOI: 10.1016/j.bmcl.2006.10.007
BindingDB Entry DOI: 10.7270/Q2959H6F
Neuropeptide Y receptor type 2
(Homo sapiens (Human))
BDBM50197025
(CHEMBL439904 | PYY(3-36))
Show SMILES CC[C@H](C)[C@H](N)C(=O)N[C@@H](CCCCN)C(=O)N1CCC[C@H]1C(=O)N[C@@H](CCC(O)=O)C(=O)N[C@@H](C)C(=O)N1CCC[C@H]1C(=O)NCC(=O)N[C@@H](CCC(O)=O)C(=O)N[C@@H](CC(O)=O)C(=O)N[C@@H](C)C(=O)N[C@@H](CO)C(=O)N1CCC[C@H]1C(=O)N[C@@H](CCC(O)=O)C(=O)N[C@@H](CCC(O)=O)C(=O)N[C@@H](CC(C)C)C(=O)N[C@@H](CC(N)=O)C(=O)N[C@@H](CCCNC(N)=N)C(=O)N[C@@H](Cc1ccc(O)cc1)C(=O)N[C@@H](Cc1ccc(O)cc1)C(=O)N[C@@H](C)C(=O)N[C@@H](CO)C(=O)N[C@@H](CC(C)C)C(=O)N[C@@H](CCCNC(N)=N)C(=O)N[C@@H](Cc1cnc[nH]1)C(=O)N[C@@H](Cc1ccc(O)cc1)C(=O)N[C@@H](CC(C)C)C(=O)N[C@@H](CC(N)=O)C(=O)N[C@@H](CC(C)C)C(=O)N[C@@H](C(C)C)C(=O)N[C@@H]([C@@H](C)O)C(=O)N[C@@H](CCCNC(N)=N)C(=O)N[C@@H](CCC(N)=O)C(=O)N[C@@H](CCCNC(N)=N)C(=O)N[C@@H](Cc1ccc(O)cc1)C(N)=O
Show InChI InChI=1S/C180H279N53O54/c1-17-91(12)141(185)171(282)214-114(27-18-19-61-181)175(286)232-67-25-33-130(232)169(280)211-111(53-58-137(247)248)147(258)204-94(15)174(285)231-66-24-32-129(231)168(279)200-82-135(244)205-109(52-57-136(245)246)152(263)226-126(80-140(253)254)157(268)203-93(14)146(257)228-128(84-235)176(287)233-68-26-34-131(233)170(281)212-113(55-60-139(251)252)154(265)210-112(54-59-138(249)250)155(266)216-117(70-87(4)5)159(270)224-124(78-133(183)242)164(275)208-106(29-21-63-197-178(189)190)150(261)220-121(75-98-39-47-103(239)48-40-98)162(273)221-120(74-97-37-45-102(238)46-38-97)156(267)202-92(13)145(256)227-127(83-234)167(278)219-116(69-86(2)3)158(269)207-107(30-22-64-198-179(191)192)151(262)223-123(77-100-81-195-85-201-100)163(274)222-122(76-99-41-49-104(240)50-42-99)161(272)217-118(71-88(6)7)160(271)225-125(79-134(184)243)165(276)218-119(72-89(8)9)166(277)229-142(90(10)11)172(283)230-143(95(16)236)173(284)213-108(31-23-65-199-180(193)194)148(259)209-110(51-56-132(182)241)153(264)206-105(28-20-62-196-177(187)188)149(260)215-115(144(186)255)73-96-35-43-101(237)44-36-96/h35-50,81,85-95,105-131,141-143,234-240H,17-34,51-80,82-84,181,185H2,1-16H3,(H2,182,241)(H2,183,242)(H2,184,243)(H2,186,255)(H,195,201)(H,200,279)(H,202,267)(H,203,268)(H,204,258)(H,205,244)(H,206,264)(H,207,269)(H,208,275)(H,209,259)(H,210,265)(H,211,280)(H,212,281)(H,213,284)(H,214,282)(H,215,260)(H,216,266)(H,217,272)(H,218,276)(H,219,278)(H,220,261)(H,221,273)(H,222,274)(H,223,262)(H,224,270)(H,225,271)(H,226,263)(H,227,256)(H,228,257)(H,229,277)(H,230,283)(H,245,246)(H,247,248)(H,249,250)(H,251,252)(H,253,254)(H4,187,188,196)(H4,189,190,197)(H4,191,192,198)(H4,193,194,199)/t91-,92-,93-,94-,95+,105-,106-,107-,108-,109-,110-,111-,112-,113-,114-,115-,116-,117-,118-,119-,120-,121-,122-,123-,124-,125-,126-,127-,128-,129-,130-,131-,141-,142-,143-/m0/s1
Reactome pathway
n/an/a 0.570n/an/an/an/an/an/a
Takeda Pharmaceutical Company, Ltd.
Curated by ChEMBL
Assay Description
Displacement of [125I]peptide YY from human Y2 receptor expressed in CHO cell membranes after 60 mins by TopCount scintillation counting analysis
Bioorg Med Chem Lett 27: 3829-3832 (2017)
Article DOI: 10.1016/j.bmcl.2017.06.055
BindingDB Entry DOI: 10.7270/Q2MK6GC2