BDBM50197210 4-((4-(but-2-ynyloxy)phenylsulfonyl)methyl)-N-hydroxy-1-(2-morpholinoethylsulfonyl)piperidine-4-carboxamide::CHEMBL234144
SMILES: CC#CCOc1ccc(cc1)S(=O)(=O)CC1(CCN(CC1)S(=O)(=O)CCN1CCOCC1)C(=O)NO
InChI Key: InChIKey=KAWCOVYOZMDLKQ-UHFFFAOYSA-N
Data: 3 IC50
Activity Spreadsheet -- Enzyme Inhibition Constant Data from BindingDB
Found 3 hits for monomerid = 50197210
Trg + Lig
Ki
nM
ΔG°
kcal/mole
IC50
nM
Kd
nM
EC50/IC50
nM
koff
s-1
kon
M-1s-1
pHTemp
°C
Disintegrin and metalloproteinase domain-containing protein 17
(Homo sapiens (Human))
BDBM50197210
(4-((4-(but-2-ynyloxy)phenylsulfonyl)methyl)-N-hydr...)
Show SMILES CC#CCOc1ccc(cc1)S(=O)(=O)CC1(CCN(CC1)S(=O)(=O)CCN1CCOCC1)C(=O)NO
Show InChI InChI=1S/C23H33N3O8S2/c1-2-3-15-34-20-4-6-21(7-5-20)35(29,30)19-23(22(27)24-28)8-10-26(11-9-23)36(31,32)18-14-25-12-16-33-17-13-25/h4-7,28H,8-19H2,1H3,(H,24,27)
Reactome pathway
n/an/a 2.20n/an/an/an/an/an/a
Wyeth Research
Curated by ChEMBL
Assay Description
Inhibition of TACE in human whole blood assay
Bioorg Med Chem Lett 17: 34-9 (2006)
Article DOI: 10.1016/j.bmcl.2006.10.004
BindingDB Entry DOI: 10.7270/Q2862G2M
Collagenase 3
(Homo sapiens (Human))
BDBM50197210
(4-((4-(but-2-ynyloxy)phenylsulfonyl)methyl)-N-hydr...)
Show SMILES CC#CCOc1ccc(cc1)S(=O)(=O)CC1(CCN(CC1)S(=O)(=O)CCN1CCOCC1)C(=O)NO
Show InChI InChI=1S/C23H33N3O8S2/c1-2-3-15-34-20-4-6-21(7-5-20)35(29,30)19-23(22(27)24-28)8-10-26(11-9-23)36(31,32)18-14-25-12-16-33-17-13-25/h4-7,28H,8-19H2,1H3,(H,24,27)
NCI pathway
Reactome pathway
n/an/a 43n/an/an/an/an/an/a
Wyeth Research
Curated by ChEMBL
Assay Description
Inhibition of MMP13
Bioorg Med Chem Lett 17: 34-9 (2006)
Article DOI: 10.1016/j.bmcl.2006.10.004
BindingDB Entry DOI: 10.7270/Q2862G2M
72 kDa type IV collagenase
(Homo sapiens (Human))
BDBM50197210
(4-((4-(but-2-ynyloxy)phenylsulfonyl)methyl)-N-hydr...)
Show SMILES CC#CCOc1ccc(cc1)S(=O)(=O)CC1(CCN(CC1)S(=O)(=O)CCN1CCOCC1)C(=O)NO
Show InChI InChI=1S/C23H33N3O8S2/c1-2-3-15-34-20-4-6-21(7-5-20)35(29,30)19-23(22(27)24-28)8-10-26(11-9-23)36(31,32)18-14-25-12-16-33-17-13-25/h4-7,28H,8-19H2,1H3,(H,24,27)
Reactome pathway
n/an/a 37n/an/an/an/an/an/a
Wyeth Research
Curated by ChEMBL
Assay Description
Inhibition of MMP2
Bioorg Med Chem Lett 17: 34-9 (2006)
Article DOI: 10.1016/j.bmcl.2006.10.004
BindingDB Entry DOI: 10.7270/Q2862G2M