BDBM50197221 4-((4-(but-2-ynyloxy)phenylsulfonyl)methyl)-N-hydroxy-1-(1-methyl-1H-benzo[d]imidazol-2-yl)piperidine-4-carboxamide::CHEMBL234566
SMILES: CC#CCOc1ccc(cc1)S(=O)(=O)CC1(CCN(CC1)c1nc2ccccc2n1C)C(=O)NO
InChI Key: InChIKey=GFRCZBUEHADXTC-UHFFFAOYSA-N
Data: 3 IC50
Activity Spreadsheet -- Enzyme Inhibition Constant Data from BindingDB
Found 3 hits for monomerid = 50197221
Trg + Lig
Ki
nM
ΔG°
kcal/mole
IC50
nM
Kd
nM
EC50/IC50
nM
koff
s-1
kon
M-1s-1
pHTemp
°C
Disintegrin and metalloproteinase domain-containing protein 17
(Homo sapiens (Human))
BDBM50197221
(4-((4-(but-2-ynyloxy)phenylsulfonyl)methyl)-N-hydr...)
Show SMILES CC#CCOc1ccc(cc1)S(=O)(=O)CC1(CCN(CC1)c1nc2ccccc2n1C)C(=O)NO
Show InChI InChI=1S/C25H28N4O5S/c1-3-4-17-34-19-9-11-20(12-10-19)35(32,33)18-25(23(30)27-31)13-15-29(16-14-25)24-26-21-7-5-6-8-22(21)28(24)2/h5-12,31H,13-18H2,1-2H3,(H,27,30)
Reactome pathway
n/an/a<1n/an/an/an/an/an/a
Wyeth Research
Curated by ChEMBL
Assay Description
Inhibition of TACE
Bioorg Med Chem Lett 17: 34-9 (2006)
Article DOI: 10.1016/j.bmcl.2006.10.004
BindingDB Entry DOI: 10.7270/Q2862G2M
72 kDa type IV collagenase
(Homo sapiens (Human))
BDBM50197221
(4-((4-(but-2-ynyloxy)phenylsulfonyl)methyl)-N-hydr...)
Show SMILES CC#CCOc1ccc(cc1)S(=O)(=O)CC1(CCN(CC1)c1nc2ccccc2n1C)C(=O)NO
Show InChI InChI=1S/C25H28N4O5S/c1-3-4-17-34-19-9-11-20(12-10-19)35(32,33)18-25(23(30)27-31)13-15-29(16-14-25)24-26-21-7-5-6-8-22(21)28(24)2/h5-12,31H,13-18H2,1-2H3,(H,27,30)
Reactome pathway
n/an/a 176n/an/an/an/an/an/a
Wyeth Research
Curated by ChEMBL
Assay Description
Inhibition of MMP2
Bioorg Med Chem Lett 17: 34-9 (2006)
Article DOI: 10.1016/j.bmcl.2006.10.004
BindingDB Entry DOI: 10.7270/Q2862G2M
Collagenase 3
(Homo sapiens (Human))
BDBM50197221
(4-((4-(but-2-ynyloxy)phenylsulfonyl)methyl)-N-hydr...)
Show SMILES CC#CCOc1ccc(cc1)S(=O)(=O)CC1(CCN(CC1)c1nc2ccccc2n1C)C(=O)NO
Show InChI InChI=1S/C25H28N4O5S/c1-3-4-17-34-19-9-11-20(12-10-19)35(32,33)18-25(23(30)27-31)13-15-29(16-14-25)24-26-21-7-5-6-8-22(21)28(24)2/h5-12,31H,13-18H2,1-2H3,(H,27,30)
NCI pathway
Reactome pathway
n/an/a 166n/an/an/an/an/an/a
Wyeth Research
Curated by ChEMBL
Assay Description
Inhibition of MMP13
Bioorg Med Chem Lett 17: 34-9 (2006)
Article DOI: 10.1016/j.bmcl.2006.10.004
BindingDB Entry DOI: 10.7270/Q2862G2M