BDBM50197227 1-(benzo[d]oxazol-2-yl)-4-((4-(but-2-ynyloxy)phenylsulfonyl)methyl)-N-hydroxypiperidine-4-carboxamide::CHEMBL393550
SMILES: CC#CCOc1ccc(cc1)S(=O)(=O)CC1(CCN(CC1)c1nc2ccccc2o1)C(=O)NO
InChI Key: InChIKey=XWVXWDVYQZEQBA-UHFFFAOYSA-N
Data: 3 IC50
Activity Spreadsheet -- Enzyme Inhibition Constant Data from BindingDB
Found 3 hits for monomerid = 50197227
Trg + Lig
Ki
nM
ΔG°
kcal/mole
IC50
nM
Kd
nM
EC50/IC50
nM
koff
s-1
kon
M-1s-1
pHTemp
°C
Disintegrin and metalloproteinase domain-containing protein 17
(Homo sapiens (Human))
BDBM50197227
(1-(benzo[d]oxazol-2-yl)-4-((4-(but-2-ynyloxy)pheny...)
Show SMILES CC#CCOc1ccc(cc1)S(=O)(=O)CC1(CCN(CC1)c1nc2ccccc2o1)C(=O)NO
Show InChI InChI=1S/C24H25N3O6S/c1-2-3-16-32-18-8-10-19(11-9-18)34(30,31)17-24(22(28)26-29)12-14-27(15-13-24)23-25-20-6-4-5-7-21(20)33-23/h4-11,29H,12-17H2,1H3,(H,26,28)
Reactome pathway
n/an/a 1.10n/an/an/an/an/an/a
Wyeth Research
Curated by ChEMBL
Assay Description
Inhibition of TACE in human whole blood assay
Bioorg Med Chem Lett 17: 34-9 (2006)
Article DOI: 10.1016/j.bmcl.2006.10.004
BindingDB Entry DOI: 10.7270/Q2862G2M
72 kDa type IV collagenase
(Homo sapiens (Human))
BDBM50197227
(1-(benzo[d]oxazol-2-yl)-4-((4-(but-2-ynyloxy)pheny...)
Show SMILES CC#CCOc1ccc(cc1)S(=O)(=O)CC1(CCN(CC1)c1nc2ccccc2o1)C(=O)NO
Show InChI InChI=1S/C24H25N3O6S/c1-2-3-16-32-18-8-10-19(11-9-18)34(30,31)17-24(22(28)26-29)12-14-27(15-13-24)23-25-20-6-4-5-7-21(20)33-23/h4-11,29H,12-17H2,1H3,(H,26,28)
Reactome pathway
n/an/a 40n/an/an/an/an/an/a
Wyeth Research
Curated by ChEMBL
Assay Description
Inhibition of MMP2
Bioorg Med Chem Lett 17: 34-9 (2006)
Article DOI: 10.1016/j.bmcl.2006.10.004
BindingDB Entry DOI: 10.7270/Q2862G2M
Collagenase 3
(Homo sapiens (Human))
BDBM50197227
(1-(benzo[d]oxazol-2-yl)-4-((4-(but-2-ynyloxy)pheny...)
Show SMILES CC#CCOc1ccc(cc1)S(=O)(=O)CC1(CCN(CC1)c1nc2ccccc2o1)C(=O)NO
Show InChI InChI=1S/C24H25N3O6S/c1-2-3-16-32-18-8-10-19(11-9-18)34(30,31)17-24(22(28)26-29)12-14-27(15-13-24)23-25-20-6-4-5-7-21(20)33-23/h4-11,29H,12-17H2,1H3,(H,26,28)
NCI pathway
Reactome pathway
n/an/a 56n/an/an/an/an/an/a
Wyeth Research
Curated by ChEMBL
Assay Description
Inhibition of MMP13
Bioorg Med Chem Lett 17: 34-9 (2006)
Article DOI: 10.1016/j.bmcl.2006.10.004
BindingDB Entry DOI: 10.7270/Q2862G2M