BDBM50197422 (2R,3S,5S)-2-[(hydrogen phosphonatooxy)methyl]-5-(hydroxymethyl)-3-(4-octylphenyl)pyrrolidin-1-ium::CHEMBL247901
SMILES: CCCCCCCCc1ccc(cc1)[C@@H]1C[C@@H](CO)[NH2+][C@H]1COP(O)([O-])=O
InChI Key: InChIKey=DXYHOMLATOQDGJ-UFYCRDLUSA-N
Data: 4 EC50
Activity Spreadsheet -- Enzyme Inhibition Constant Data from BindingDB
Found 4 hits for monomerid = 50197422
Trg + Lig
Ki
nM
ΔG°
kcal/mole
IC50
nM
Kd
nM
EC50/IC50
nM
koff
s-1
kon
M-1s-1
pHTemp
°C
Sphingosine 1-phosphate receptor 3
(Homo sapiens (Human))
BDBM50197422
((2R,3S,5S)-2-[(hydrogen phosphonatooxy)methyl]-5-(...)
Show SMILES CCCCCCCCc1ccc(cc1)[C@@H]1C[C@@H](CO)[NH2+][C@H]1COP(O)([O-])=O |w:23.26|
Show InChI InChI=1S/C20H34NO5P/c1-2-3-4-5-6-7-8-16-9-11-17(12-10-16)19-13-18(14-22)21-20(19)15-26-27(23,24)25/h9-12,18-22H,2-8,13-15H2,1H3,(H2,23,24,25)/t18-,19-,20-/m0/s1
NCI pathway
Reactome pathway
n/an/an/an/a>1.00E+3n/an/an/an/a
Universit£ de Montr£al
Curated by ChEMBL
Assay Description
Activity at human recombinant S1P3 receptor expressed in CHO cells assessed as increase in calcium release by FLIPR assay
Bioorg Med Chem Lett 17: 491-4 (2007)
Article DOI: 10.1016/j.bmcl.2006.10.014
BindingDB Entry DOI: 10.7270/Q2028SCS
Sphingosine 1-phosphate receptor 1
(Homo sapiens (Human))
BDBM50197422
((2R,3S,5S)-2-[(hydrogen phosphonatooxy)methyl]-5-(...)
Show SMILES CCCCCCCCc1ccc(cc1)[C@@H]1C[C@@H](CO)[NH2+][C@H]1COP(O)([O-])=O |w:23.26|
Show InChI InChI=1S/C20H34NO5P/c1-2-3-4-5-6-7-8-16-9-11-17(12-10-16)19-13-18(14-22)21-20(19)15-26-27(23,24)25/h9-12,18-22H,2-8,13-15H2,1H3,(H2,23,24,25)/t18-,19-,20-/m0/s1
Reactome pathway
n/an/an/an/a>1.00E+3n/an/an/an/a
Universit£ de Montr£al
Curated by ChEMBL
Assay Description
Activity at human recombinant S1P1 receptor expressed in CHO cells assessed as increase in calcium release by FLIPR assay
Bioorg Med Chem Lett 17: 491-4 (2007)
Article DOI: 10.1016/j.bmcl.2006.10.014
BindingDB Entry DOI: 10.7270/Q2028SCS
Sphingosine 1-phosphate receptor 4
(Homo sapiens (Human))
BDBM50197422
((2R,3S,5S)-2-[(hydrogen phosphonatooxy)methyl]-5-(...)
Show SMILES CCCCCCCCc1ccc(cc1)[C@@H]1C[C@@H](CO)[NH2+][C@H]1COP(O)([O-])=O |w:23.26|
Show InChI InChI=1S/C20H34NO5P/c1-2-3-4-5-6-7-8-16-9-11-17(12-10-16)19-13-18(14-22)21-20(19)15-26-27(23,24)25/h9-12,18-22H,2-8,13-15H2,1H3,(H2,23,24,25)/t18-,19-,20-/m0/s1
NCI pathway
Reactome pathway
n/an/an/an/a 33.1n/an/an/an/a
Universit£ de Montr£al
Curated by ChEMBL
Assay Description
Activity at human recombinant S1P4 receptor expressed in CHO cells assessed as increase in calcium release by FLIPR assay
Bioorg Med Chem Lett 17: 491-4 (2007)
Article DOI: 10.1016/j.bmcl.2006.10.014
BindingDB Entry DOI: 10.7270/Q2028SCS
Sphingosine 1-phosphate receptor 5
(Homo sapiens (Human))
BDBM50197422
((2R,3S,5S)-2-[(hydrogen phosphonatooxy)methyl]-5-(...)
Show SMILES CCCCCCCCc1ccc(cc1)[C@@H]1C[C@@H](CO)[NH2+][C@H]1COP(O)([O-])=O |w:23.26|
Show InChI InChI=1S/C20H34NO5P/c1-2-3-4-5-6-7-8-16-9-11-17(12-10-16)19-13-18(14-22)21-20(19)15-26-27(23,24)25/h9-12,18-22H,2-8,13-15H2,1H3,(H2,23,24,25)/t18-,19-,20-/m0/s1
NCI pathway
Reactome pathway
n/an/an/an/a 21.3n/an/an/an/a
Universit£ de Montr£al
Curated by ChEMBL
Assay Description
Activity at human recombinant S1P5 receptor expressed in CHO cells assessed as increase in calcium release by FLIPR assay
Bioorg Med Chem Lett 17: 491-4 (2007)
Article DOI: 10.1016/j.bmcl.2006.10.014
BindingDB Entry DOI: 10.7270/Q2028SCS