BDBM50197552 CHEMBL3966078
SMILES: CC[C@H](NS(=O)(=O)N[C@@H](CCCCN)C(O)=O)C(=O)N[C@H]1C[C@H]2CC[C@]1(C)C2(C)C
InChI Key: InChIKey=WCKOBJUGMBTSIE-HYUNPYRHSA-N
Data: 1 IC50
Activity Spreadsheet -- Enzyme Inhibition Constant Data from BindingDB
Found 1 hit for monomerid = 50197552
Trg + Lig
Ki
nM
ΔG°
kcal/mole
IC50
nM
Kd
nM
EC50/IC50
nM
koff
s-1
kon
M-1s-1
pHTemp
°C
Carboxypeptidase B2 isoform A
(Homo sapiens (Human))
BDBM50197552
(CHEMBL3966078)
Show SMILES CC[C@H](NS(=O)(=O)N[C@@H](CCCCN)C(O)=O)C(=O)N[C@H]1C[C@H]2CC[C@]1(C)C2(C)C |r,TLB:19:20:24.23:27|
Show InChI InChI=1S/C20H38N4O5S/c1-5-14(23-30(28,29)24-15(18(26)27)8-6-7-11-21)17(25)22-16-12-13-9-10-20(16,4)19(13,2)3/h13-16,23-24H,5-12,21H2,1-4H3,(H,22,25)(H,26,27)/t13-,14+,15+,16+,20+/m1/s1
Reactome pathway
n/an/a 2.30E+3n/an/an/an/an/an/a
Sanofi R&D
Curated by ChEMBL
Assay Description
Inhibition of activated human plasma TAFI incubated for 15 mins by chromogenic assay
J Med Chem 59: 9567-9573 (2016)
Article DOI: 10.1021/acs.jmedchem.6b01276
BindingDB Entry DOI: 10.7270/Q2MG7RG2