BDBM50197561 CHEMBL3985242
SMILES: CC(C)(C)NC(=O)[C@H](CC1CCCCC1)NS(=O)(=O)N[C@@H](CCCCN)C(O)=O
InChI Key: InChIKey=LVOZNJMCMRKNQO-HOTGVXAUSA-N
Data: 1 IC50
Activity Spreadsheet -- Enzyme Inhibition Constant Data from BindingDB
Found 1 hit for monomerid = 50197561
Trg + Lig
Ki
nM
ΔG°
kcal/mole
IC50
nM
Kd
nM
EC50/IC50
nM
koff
s-1
kon
M-1s-1
pHTemp
°C
Carboxypeptidase B2 isoform A
(Homo sapiens (Human))
BDBM50197561
(CHEMBL3985242)
Show SMILES CC(C)(C)NC(=O)[C@H](CC1CCCCC1)NS(=O)(=O)N[C@@H](CCCCN)C(O)=O |r|
Show InChI InChI=1S/C19H38N4O5S/c1-19(2,3)21-17(24)16(13-14-9-5-4-6-10-14)23-29(27,28)22-15(18(25)26)11-7-8-12-20/h14-16,22-23H,4-13,20H2,1-3H3,(H,21,24)(H,25,26)/t15-,16-/m0/s1
Reactome pathway
n/an/a 6.70E+3n/an/an/an/an/an/a
Sanofi R&D
Curated by ChEMBL
Assay Description
Inhibition of activated human plasma TAFI incubated for 15 mins by chromogenic assay
J Med Chem 59: 9567-9573 (2016)
Article DOI: 10.1021/acs.jmedchem.6b01276
BindingDB Entry DOI: 10.7270/Q2MG7RG2