BDBM50197563 CHEMBL3963543
SMILES: CC1(C)[C@@H]2CC[C@@]1(C)[C@H](C2)NC(=O)[C@H](CC1CCCCC1)NS(=O)(=O)N[C@@H](Cc1cnc[nH]1)C(O)=O
InChI Key: InChIKey=MWDYDFUMFPIWRS-FAJCANAKSA-N
Data: 1 IC50
Activity Spreadsheet -- Enzyme Inhibition Constant Data from BindingDB
Found 1 hit for monomerid = 50197563
Trg + Lig
Ki
nM
ΔG°
kcal/mole
IC50
nM
Kd
nM
EC50/IC50
nM
koff
s-1
kon
M-1s-1
pHTemp
°C
Carboxypeptidase B2 isoform A
(Homo sapiens (Human))
BDBM50197563
(CHEMBL3963543)
Show SMILES CC1(C)[C@@H]2CC[C@@]1(C)[C@H](C2)NC(=O)[C@H](CC1CCCCC1)NS(=O)(=O)N[C@@H](Cc1cnc[nH]1)C(O)=O |r,THB:10:8:5.4:1|
Show InChI InChI=1S/C25H41N5O5S/c1-24(2)17-9-10-25(24,3)21(12-17)28-22(31)19(11-16-7-5-4-6-8-16)29-36(34,35)30-20(23(32)33)13-18-14-26-15-27-18/h14-17,19-21,29-30H,4-13H2,1-3H3,(H,26,27)(H,28,31)(H,32,33)/t17-,19+,20+,21+,25+/m1/s1
Reactome pathway
n/an/a 4.40E+3n/an/an/an/an/an/a
Sanofi R&D
Curated by ChEMBL
Assay Description
Inhibition of activated human plasma TAFI incubated for 15 mins by chromogenic assay
J Med Chem 59: 9567-9573 (2016)
Article DOI: 10.1021/acs.jmedchem.6b01276
BindingDB Entry DOI: 10.7270/Q2MG7RG2