BDBM50197800 CHEMBL3896012
SMILES: CNS(=O)(=O)c1ccc(OCC(F)(F)F)c(Nc2cc(Nc3ccc(Cl)cc3)ncn2)c1
InChI Key: InChIKey=KYZUCJJGVPFWBY-UHFFFAOYSA-N
Data: 2 IC50
Activity Spreadsheet -- Enzyme Inhibition Constant Data from BindingDB
Found 2 hits for monomerid = 50197800
Trg + Lig
Ki
nM
ΔG°
kcal/mole
IC50
nM
Kd
nM
EC50/IC50
nM
koff
s-1
kon
M-1s-1
pHTemp
°C
TNNI3K
(Homo sapiens (Human))
BDBM50197800
(CHEMBL3896012)
Show SMILES CNS(=O)(=O)c1ccc(OCC(F)(F)F)c(Nc2cc(Nc3ccc(Cl)cc3)ncn2)c1
Show InChI InChI=1S/C19H17ClF3N5O3S/c1-24-32(29,30)14-6-7-16(31-10-19(21,22)23)15(8-14)28-18-9-17(25-11-26-18)27-13-4-2-12(20)3-5-13/h2-9,11,24H,10H2,1H3,(H2,25,26,27,28)
n/an/a 25n/an/an/an/an/an/a
TBA
Curated by ChEMBL
Assay Description
Inhibition of 5-({[2-({[3-({4-[(5-hydroxy-2-methylphenyl)amino]-2-pyrimidinyl}amino)phenyl]carbonyl}amino)-ethyl]amino}carbonyl)-2-(6-hydroxy-3-oxo-3...
J Med Chem 61: 3076-3088 (2018)
Article DOI: 10.1021/acs.jmedchem.8b00125
BindingDB Entry DOI: 10.7270/Q2Z3221C
TNNI3K
(Homo sapiens (Human))
BDBM50197800
(CHEMBL3896012)
Show SMILES CNS(=O)(=O)c1ccc(OCC(F)(F)F)c(Nc2cc(Nc3ccc(Cl)cc3)ncn2)c1
Show InChI InChI=1S/C19H17ClF3N5O3S/c1-24-32(29,30)14-6-7-16(31-10-19(21,22)23)15(8-14)28-18-9-17(25-11-26-18)27-13-4-2-12(20)3-5-13/h2-9,11,24H,10H2,1H3,(H2,25,26,27,28)
n/an/a 25n/an/an/an/an/an/a
GlaxoSmithKline
Curated by ChEMBL
Assay Description
Displacement of 5-({[2-({[3-({4-[(5-hydroxy-2-methylphenyl)amino]-2-pyrimidinyl}amino)phenyl]carbonyl}amino)-ethyl]amino}carbonyl)-2-(6-hydroxy-3-oxo...
J Med Chem 59: 10629-10641 (2016)
Article DOI: 10.1021/acs.jmedchem.6b01342
BindingDB Entry DOI: 10.7270/Q2V126RT