BDBM50197838 CHEMBL227965::Corytuberine
SMILES: COc1ccc2C[C@@H]3N(C)CCc4cc(OC)c(O)c(c34)-c2c1O
InChI Key: InChIKey=WHFUDAOCYRYAKQ-LBPRGKRZSA-N
Data: 1 IC50
Activity Spreadsheet -- Enzyme Inhibition Constant Data from BindingDB
Found 1 hit for monomerid = 50197838
Trg + Lig
Ki
nM
ΔG°
kcal/mole
IC50
nM
Kd
nM
EC50/IC50
nM
koff
s-1
kon
M-1s-1
pHTemp
°C
Cyclin-dependent kinase 2
(Homo sapiens (Human))
BDBM50197838
(CHEMBL227965 | Corytuberine)
Show SMILES COc1ccc2C[C@@H]3N(C)CCc4cc(OC)c(O)c(c34)-c2c1O |r|
Show InChI InChI=1S/C19H21NO4/c1-20-7-6-11-9-14(24-3)19(22)17-15(11)12(20)8-10-4-5-13(23-2)18(21)16(10)17/h4-5,9,12,21-22H,6-8H2,1-3H3/t12-/m0/s1
NCI pathway
Reactome pathway
n/an/a>5.00E+4n/an/an/an/an/an/a
Schering Plough Research Institute
Curated by ChEMBL
Assay Description
Inhibition of CDK2
Bioorg Med Chem Lett 20: 1384-7 (2010)
Article DOI: 10.1016/j.bmcl.2010.01.007
BindingDB Entry DOI: 10.7270/Q2QF8TTB