BDBM50198501 (S)-5-(4-chlorophenyl)-N-(6-((dimethylamino)methyl)-1,2,3,4-tetrahydronaphthalen-2-yl)-N-methylpicolinamide::CHEMBL215278
SMILES: CN(C)Cc1ccc2C[C@H](CCc2c1)N(C)C(=O)c1ccc(cn1)-c1ccc(Cl)cc1
InChI Key: InChIKey=JGTFYTXGSPCVDN-DEOSSOPVSA-N
Data: 1 KI  2 IC50
Activity Spreadsheet -- Enzyme Inhibition Constant Data from BindingDB
Found 3 hits for monomerid = 50198501
Trg + Lig
Ki
nM
ΔG°
kcal/mole
IC50
nM
Kd
nM
EC50/IC50
nM
koff
s-1
kon
M-1s-1
pHTemp
°C
Melanin-concentrating hormone receptor 1
(Homo sapiens (Human))
BDBM50198501
((S)-5-(4-chlorophenyl)-N-(6-((dimethylamino)methyl...)
Show SMILES CN(C)Cc1ccc2C[C@H](CCc2c1)N(C)C(=O)c1ccc(cn1)-c1ccc(Cl)cc1
Show InChI InChI=1S/C26H28ClN3O/c1-29(2)17-18-4-5-21-15-24(12-8-20(21)14-18)30(3)26(31)25-13-9-22(16-28-25)19-6-10-23(27)11-7-19/h4-7,9-11,13-14,16,24H,8,12,15,17H2,1-3H3/t24-/m0/s1
Reactome pathway
11n/an/an/an/an/an/an/an/a
Procter & Gamble Pharmaceuticals
Curated by ChEMBL
Assay Description
Functional antagonism of MCH-R1 expressed in HEK293 cells
Bioorg Med Chem Lett 17: 814-8 (2007)
Article DOI: 10.1016/j.bmcl.2006.10.053
BindingDB Entry DOI: 10.7270/Q2R2111C
Potassium voltage-gated channel subfamily H member 2
(Homo sapiens (Human))
BDBM50198501
((S)-5-(4-chlorophenyl)-N-(6-((dimethylamino)methyl...)
Show SMILES CN(C)Cc1ccc2C[C@H](CCc2c1)N(C)C(=O)c1ccc(cn1)-c1ccc(Cl)cc1
Show InChI InChI=1S/C26H28ClN3O/c1-29(2)17-18-4-5-21-15-24(12-8-20(21)14-18)30(3)26(31)25-13-9-22(16-28-25)19-6-10-23(27)11-7-19/h4-7,9-11,13-14,16,24H,8,12,15,17H2,1-3H3/t24-/m0/s1
Reactome pathway
n/an/a 2.60E+3n/an/an/an/an/an/a
Procter & Gamble Pharmaceuticals
Curated by ChEMBL
Assay Description
Inhibition of binding to hERG
Bioorg Med Chem Lett 17: 814-8 (2007)
Article DOI: 10.1016/j.bmcl.2006.10.053
BindingDB Entry DOI: 10.7270/Q2R2111C
5-hydroxytryptamine receptor 2C
(Homo sapiens (Human))
BDBM50198501
((S)-5-(4-chlorophenyl)-N-(6-((dimethylamino)methyl...)
Show SMILES CN(C)Cc1ccc2C[C@H](CCc2c1)N(C)C(=O)c1ccc(cn1)-c1ccc(Cl)cc1
Show InChI InChI=1S/C26H28ClN3O/c1-29(2)17-18-4-5-21-15-24(12-8-20(21)14-18)30(3)26(31)25-13-9-22(16-28-25)19-6-10-23(27)11-7-19/h4-7,9-11,13-14,16,24H,8,12,15,17H2,1-3H3/t24-/m0/s1
Reactome pathway
n/an/a 5.60E+4n/an/an/an/an/an/a
Procter & Gamble Pharmaceuticals
Curated by ChEMBL
Assay Description
Inhibition of binding to serotonin receptor 5HT2C
Bioorg Med Chem Lett 17: 814-8 (2007)
Article DOI: 10.1016/j.bmcl.2006.10.053
BindingDB Entry DOI: 10.7270/Q2R2111C