BDBM50198772 CHEMBL3929569
SMILES: O=C(Nc1ccccc1)\C=C1/SC(=S)NC1=O
InChI Key: InChIKey=SZBBMYHWEGNZOX-VURMDHGXSA-N
Data: 1 KI  1 IC50
Activity Spreadsheet -- Enzyme Inhibition Constant Data from BindingDB
Found 2 hits for monomerid = 50198772
Trg + Lig
Ki
nM
ΔG°
kcal/mole
IC50
nM
Kd
nM
EC50/IC50
nM
koff
s-1
kon
M-1s-1
pHTemp
°C
CDGSH iron-sulfur domain-containing protein 1
(Homo sapiens (Human))
BDBM50198772
(CHEMBL3929569)
Show SMILES O=C(Nc1ccccc1)\C=C1/SC(=S)NC1=O
Show InChI InChI=1S/C11H8N2O2S2/c14-9(12-7-4-2-1-3-5-7)6-8-10(15)13-11(16)17-8/h1-6H,(H,12,14)(H,13,15,16)/b8-6-
472n/an/an/an/an/an/an/an/a
West Virginia University
Curated by ChEMBL
Assay Description
Displacement of [3H]rosiglitazone from recombinant human C-terminal His-tagged MitoNEET cytosolic domain (32 to 108 residues) expressed in Escherichi...
Bioorg Med Chem Lett 26: 5350-5353 (2016)
Article DOI: 10.1016/j.bmcl.2016.09.009
BindingDB Entry DOI: 10.7270/Q2ZP483C
CDGSH iron-sulfur domain-containing protein 1
(Homo sapiens (Human))
BDBM50198772
(CHEMBL3929569)
Show SMILES O=C(Nc1ccccc1)\C=C1/SC(=S)NC1=O
Show InChI InChI=1S/C11H8N2O2S2/c14-9(12-7-4-2-1-3-5-7)6-8-10(15)13-11(16)17-8/h1-6H,(H,12,14)(H,13,15,16)/b8-6-
n/an/a 1.11E+4n/an/an/an/an/an/a
West Virginia University
Curated by ChEMBL
Assay Description
Displacement of [3H]rosiglitazone from recombinant human C-terminal His-tagged MitoNEET cytosolic domain (32 to 108 residues) expressed in Escherichi...
Bioorg Med Chem Lett 26: 5350-5353 (2016)
Article DOI: 10.1016/j.bmcl.2016.09.009
BindingDB Entry DOI: 10.7270/Q2ZP483C