BDBM50198781 4-(7-(2-(hydroxymethyl)phenyl)-6-methylbenzo[e][1,2,4]triazin-3-ylamino)-N-(2-(pyrrolidin-1-yl)ethyl)benzenesulfonamide::CHEMBL230509::US8481536, 451
SMILES: Cc1cc2nc(Nc3ccc(cc3)S(=O)(=O)NCCN3CCCC3)nnc2cc1-c1ccccc1CO
InChI Key: InChIKey=WGYVOINAPLYJAH-UHFFFAOYSA-N
Data: 2 IC50
Activity Spreadsheet -- Enzyme Inhibition Constant Data from BindingDB
Found 2 hits for monomerid = 50198781
Trg + Lig
Ki
nM
ΔG°
kcal/mole
IC50
nM
Kd
nM
EC50/IC50
nM
koff
s-1
kon
M-1s-1
pHTemp
°C
Proto-oncogene tyrosine-protein kinase Src
(Homo sapiens (Human))
BDBM50198781
(4-(7-(2-(hydroxymethyl)phenyl)-6-methylbenzo[e][1,...)
Show SMILES Cc1cc2nc(Nc3ccc(cc3)S(=O)(=O)NCCN3CCCC3)nnc2cc1-c1ccccc1CO
Show InChI InChI=1S/C27H30N6O3S/c1-19-16-25-26(17-24(19)23-7-3-2-6-20(23)18-34)31-32-27(30-25)29-21-8-10-22(11-9-21)37(35,36)28-12-15-33-13-4-5-14-33/h2-3,6-11,16-17,28,34H,4-5,12-15,18H2,1H3,(H,29,30,32)
n/an/a 72n/an/an/an/an/an/a
TargeGen, Inc.
Curated by ChEMBL
Assay Description
Inhibition of Src
Bioorg Med Chem Lett 17: 602-8 (2007)
Article DOI: 10.1016/j.bmcl.2006.11.006
BindingDB Entry DOI: 10.7270/Q29024MW
Proto-oncogene tyrosine-protein kinase Src
(Homo sapiens (Human))
BDBM50198781
(4-(7-(2-(hydroxymethyl)phenyl)-6-methylbenzo[e][1,...)
Show SMILES Cc1cc2nc(Nc3ccc(cc3)S(=O)(=O)NCCN3CCCC3)nnc2cc1-c1ccccc1CO
Show InChI InChI=1S/C27H30N6O3S/c1-19-16-25-26(17-24(19)23-7-3-2-6-20(23)18-34)31-32-27(30-25)29-21-8-10-22(11-9-21)37(35,36)28-12-15-33-13-4-5-14-33/h2-3,6-11,16-17,28,34H,4-5,12-15,18H2,1H3,(H,29,30,32)
US Patent
n/an/a 72.2n/an/an/an/an/a25
TargeGen, Inc.
US Patent
Assay Description
Testing of inhibition of kinases in vitro using luciferase-based assay from KinaseGlo, Promega Corp.
US Patent US8481536 (2013)
BindingDB Entry DOI: 10.7270/Q2GB22PZ