BDBM50198791 7-(2,6-dimethylphenyl)-5-methyl-N-(2-(2-(pyrrolidin-1-yl)ethoxy)pyridin-4-yl)benzo[e][1,2,4]triazin-3-amine::CHEMBL437004::US8481536, 388::US8481536, 584
SMILES: Cc1cccc(C)c1-c1cc(C)c2nc(Nc3ccnc(OCCN4CCCC4)c3)nnc2c1
InChI Key: InChIKey=YHHHJKZCRBUOTD-UHFFFAOYSA-N
Data: 3 IC50
Activity Spreadsheet -- Enzyme Inhibition Constant Data from BindingDB
Found 3 hits for monomerid = 50198791
Trg + Lig
Ki
nM
ΔG°
kcal/mole
IC50
nM
Kd
nM
EC50/IC50
nM
koff
s-1
kon
M-1s-1
pHTemp
°C
Proto-oncogene tyrosine-protein kinase Src
(Homo sapiens (Human))
BDBM50198791
(7-(2,6-dimethylphenyl)-5-methyl-N-(2-(2-(pyrrolidi...)
Show SMILES Cc1cccc(C)c1-c1cc(C)c2nc(Nc3ccnc(OCCN4CCCC4)c3)nnc2c1
Show InChI InChI=1S/C27H30N6O/c1-18-7-6-8-19(2)25(18)21-15-20(3)26-23(16-21)31-32-27(30-26)29-22-9-10-28-24(17-22)34-14-13-33-11-4-5-12-33/h6-10,15-17H,4-5,11-14H2,1-3H3,(H,28,29,30,32)
US Patent
n/an/a 5.60n/an/an/an/an/a25
TargeGen, Inc.
US Patent
Assay Description
Testing of inhibition of kinases in vitro using luciferase-based assay from KinaseGlo, Promega Corp.
US Patent US8481536 (2013)
BindingDB Entry DOI: 10.7270/Q2GB22PZ
Proto-oncogene tyrosine-protein kinase Src
(Homo sapiens (Human))
BDBM50198791
(7-(2,6-dimethylphenyl)-5-methyl-N-(2-(2-(pyrrolidi...)
Show SMILES Cc1cccc(C)c1-c1cc(C)c2nc(Nc3ccnc(OCCN4CCCC4)c3)nnc2c1
Show InChI InChI=1S/C27H30N6O/c1-18-7-6-8-19(2)25(18)21-15-20(3)26-23(16-21)31-32-27(30-26)29-22-9-10-28-24(17-22)34-14-13-33-11-4-5-12-33/h6-10,15-17H,4-5,11-14H2,1-3H3,(H,28,29,30,32)
n/an/a 6.40n/an/an/an/an/an/a
TargeGen, Inc.
Curated by ChEMBL
Assay Description
Inhibition of Src
Bioorg Med Chem Lett 17: 602-8 (2007)
Article DOI: 10.1016/j.bmcl.2006.11.006
BindingDB Entry DOI: 10.7270/Q29024MW
Ephrin type-B receptor 4
(Homo sapiens (Human))
BDBM50198791
(7-(2,6-dimethylphenyl)-5-methyl-N-(2-(2-(pyrrolidi...)
Show SMILES Cc1cccc(C)c1-c1cc(C)c2nc(Nc3ccnc(OCCN4CCCC4)c3)nnc2c1
Show InChI InChI=1S/C27H30N6O/c1-18-7-6-8-19(2)25(18)21-15-20(3)26-23(16-21)31-32-27(30-26)29-22-9-10-28-24(17-22)34-14-13-33-11-4-5-12-33/h6-10,15-17H,4-5,11-14H2,1-3H3,(H,28,29,30,32)
Reactome pathway
US Patent
n/an/a 128n/an/an/an/an/a37
TargeGen, Inc.
US Patent
Assay Description
Testing of inhibition of kinases in vitro using luciferase-based assay from KinaseGlo, Promega Corp.
US Patent US8481536 (2013)
BindingDB Entry DOI: 10.7270/Q2GB22PZ