BDBM50198796 4-(7-(2,6-dichlorophenyl)-5-methylbenzo[e][1,2,4]triazin-3-ylamino)-N-(2-(pyrrolidin-1-yl)ethyl)benzenesulfonamide::CHEMBL231219::US8481536, 526
SMILES: Cc1cc(cc2nnc(Nc3ccc(cc3)S(=O)(=O)NCCN3CCCC3)nc12)-c1c(Cl)cccc1Cl
InChI Key: InChIKey=PLKBPPWRKVPIKS-UHFFFAOYSA-N
Data: 2 IC50
Activity Spreadsheet -- Enzyme Inhibition Constant Data from BindingDB
Found 2 hits for monomerid = 50198796
Trg + Lig
Ki
nM
ΔG°
kcal/mole
IC50
nM
Kd
nM
EC50/IC50
nM
koff
s-1
kon
M-1s-1
pHTemp
°C
Proto-oncogene tyrosine-protein kinase Src
(Homo sapiens (Human))
BDBM50198796
(4-(7-(2,6-dichlorophenyl)-5-methylbenzo[e][1,2,4]t...)
Show SMILES Cc1cc(cc2nnc(Nc3ccc(cc3)S(=O)(=O)NCCN3CCCC3)nc12)-c1c(Cl)cccc1Cl
Show InChI InChI=1S/C26H26Cl2N6O2S/c1-17-15-18(24-21(27)5-4-6-22(24)28)16-23-25(17)31-26(33-32-23)30-19-7-9-20(10-8-19)37(35,36)29-11-14-34-12-2-3-13-34/h4-10,15-16,29H,2-3,11-14H2,1H3,(H,30,31,33)
n/an/a 14n/an/an/an/an/an/a
TargeGen, Inc.
Curated by ChEMBL
Assay Description
Inhibition of Src
Bioorg Med Chem Lett 17: 602-8 (2007)
Article DOI: 10.1016/j.bmcl.2006.11.006
BindingDB Entry DOI: 10.7270/Q29024MW
Proto-oncogene tyrosine-protein kinase Src
(Homo sapiens (Human))
BDBM50198796
(4-(7-(2,6-dichlorophenyl)-5-methylbenzo[e][1,2,4]t...)
Show SMILES Cc1cc(cc2nnc(Nc3ccc(cc3)S(=O)(=O)NCCN3CCCC3)nc12)-c1c(Cl)cccc1Cl
Show InChI InChI=1S/C26H26Cl2N6O2S/c1-17-15-18(24-21(27)5-4-6-22(24)28)16-23-25(17)31-26(33-32-23)30-19-7-9-20(10-8-19)37(35,36)29-11-14-34-12-2-3-13-34/h4-10,15-16,29H,2-3,11-14H2,1H3,(H,30,31,33)
US Patent
n/an/a 14n/an/an/an/an/a25
TargeGen, Inc.
US Patent
Assay Description
Testing of inhibition of kinases in vitro using luciferase-based assay from KinaseGlo, Promega Corp.
US Patent US8481536 (2013)
BindingDB Entry DOI: 10.7270/Q2GB22PZ