BDBM50198815 CHEMBL230820::N-(3-(7-(2,6-dimethylphenyl)-5-methylbenzo[e][1,2,4]triazin-3-ylamino)phenyl)-N-(2-(pyrrolidin-1-yl)ethyl)benzamide
SMILES: Cc1cccc(C)c1-c1cc(C)c2nc(Nc3cccc(c3)N(CCN3CCCC3)C(=O)c3ccccc3)nnc2c1
InChI Key: InChIKey=PUMXEUMJPWUEQO-UHFFFAOYSA-N
Data: 1 IC50
Activity Spreadsheet -- Enzyme Inhibition Constant Data from BindingDB
Found 1 hit for monomerid = 50198815
Trg + Lig
Ki
nM
ΔG°
kcal/mole
IC50
nM
Kd
nM
EC50/IC50
nM
koff
s-1
kon
M-1s-1
pHTemp
°C
Proto-oncogene tyrosine-protein kinase Src
(Homo sapiens (Human))
BDBM50198815
(CHEMBL230820 | N-(3-(7-(2,6-dimethylphenyl)-5-meth...)
Show SMILES Cc1cccc(C)c1-c1cc(C)c2nc(Nc3cccc(c3)N(CCN3CCCC3)C(=O)c3ccccc3)nnc2c1
Show InChI InChI=1S/C35H36N6O/c1-24-11-9-12-25(2)32(24)28-21-26(3)33-31(22-28)38-39-35(37-33)36-29-15-10-16-30(23-29)41(20-19-40-17-7-8-18-40)34(42)27-13-5-4-6-14-27/h4-6,9-16,21-23H,7-8,17-20H2,1-3H3,(H,36,37,39)
n/an/a 18n/an/an/an/an/an/a
TargeGen, Inc.
Curated by ChEMBL
Assay Description
Inhibition of Src
Bioorg Med Chem Lett 17: 602-8 (2007)
Article DOI: 10.1016/j.bmcl.2006.11.006
BindingDB Entry DOI: 10.7270/Q29024MW