BDBM50198884 CHEMBL3928502
SMILES: CCCN1C(=O)S\C(=C/c2ccncc2)C1=O
InChI Key: InChIKey=SGIZZQKMDAUFPA-NTMALXAHSA-N
Data: 1 KI  1 IC50
Activity Spreadsheet -- Enzyme Inhibition Constant Data from BindingDB
Found 2 hits for monomerid = 50198884
Trg + Lig
Ki
nM
ΔG°
kcal/mole
IC50
nM
Kd
nM
EC50/IC50
nM
koff
s-1
kon
M-1s-1
pHTemp
°C
CDGSH iron-sulfur domain-containing protein 1
(Homo sapiens (Human))
BDBM50198884
(CHEMBL3928502)
Show SMILES CCCN1C(=O)S\C(=C/c2ccncc2)C1=O
Show InChI InChI=1S/C12H12N2O2S/c1-2-7-14-11(15)10(17-12(14)16)8-9-3-5-13-6-4-9/h3-6,8H,2,7H2,1H3/b10-8-
831n/an/an/an/an/an/an/an/a
West Virginia University
Curated by ChEMBL
Assay Description
Displacement of [3H]rosiglitazone from recombinant human C-terminal His-tagged MitoNEET cytosolic domain (32 to 108 residues) expressed in Escherichi...
Bioorg Med Chem Lett 26: 5350-5353 (2016)
Article DOI: 10.1016/j.bmcl.2016.09.009
BindingDB Entry DOI: 10.7270/Q2ZP483C
CDGSH iron-sulfur domain-containing protein 1
(Homo sapiens (Human))
BDBM50198884
(CHEMBL3928502)
Show SMILES CCCN1C(=O)S\C(=C/c2ccncc2)C1=O
Show InChI InChI=1S/C12H12N2O2S/c1-2-7-14-11(15)10(17-12(14)16)8-9-3-5-13-6-4-9/h3-6,8H,2,7H2,1H3/b10-8-
n/an/a 1.94E+4n/an/an/an/an/an/a
West Virginia University
Curated by ChEMBL
Assay Description
Displacement of [3H]rosiglitazone from recombinant human C-terminal His-tagged MitoNEET cytosolic domain (32 to 108 residues) expressed in Escherichi...
Bioorg Med Chem Lett 26: 5350-5353 (2016)
Article DOI: 10.1016/j.bmcl.2016.09.009
BindingDB Entry DOI: 10.7270/Q2ZP483C