null
SMILES: CC1CCN(CC1)C(=O)C(CCn1cccc1C#N)NS(=O)(=O)c1c(N)cc(Cl)cc1Cl
InChI Key: InChIKey=ACGUCMXPWIANLN-UHFFFAOYSA-N
Activity Spreadsheet -- Enzyme Inhibition Constant Data from BindingDB
Found 1 hit for monomerid = 50199029
Trg + Lig
Ki
nM
ΔG°
kcal/mole
IC50
nM
Kd
nM
EC50/IC50
nM
koff
s-1
kon
M-1s-1
pHTemp
°C
C-C chemokine receptor type 10
(Homo sapiens (Human))
BDBM50199029
(CHEMBL3959737)
Show SMILES CC1CCN(CC1)C(=O)C(CCn1cccc1C#N)NS(=O)(=O)c1c(N)cc(Cl)cc1Cl
Show InChI InChI=1S/C21H25Cl2N5O3S/c1-14-4-8-28(9-5-14)21(29)19(6-10-27-7-2-3-16(27)13-24)26-32(30,31)20-17(23)11-15(22)12-18(20)25/h2-3,7,11-12,14,19,26H,4-6,8-10,25H2,1H3
n/an/a 40n/an/an/an/an/an/a
Boehringer Ingelheim Pharmaceuticals
Curated by ChEMBL
Assay Description
Antagonist activity at human CCR10 expressed in CHOK1 cells coexpressing aequorin/Galphaq assessed as inhibition of human CCL27-dependent calcium flu...
Bioorg Med Chem Lett 26: 5277-5283 (2016)
Article DOI: 10.1016/j.bmcl.2016.09.047
BindingDB Entry DOI: 10.7270/Q2KD20WF