BDBM50199048 13-cyclohexyl-5-iso-propyl-6,7-dihydro-5H-benzo[5,6][1,4]diazepino[7,1-a]indole-10-carboxylic acid::CHEMBL216143
SMILES: CC(C)N1CCn2c(c(C3CCCCC3)c3ccc(cc23)C(O)=O)-c2ccccc12
InChI Key: InChIKey=RDGAUFRTRMXBJW-UHFFFAOYSA-N
Data: 1 IC50
Activity Spreadsheet -- Enzyme Inhibition Constant Data from BindingDB
Found 1 hit for monomerid = 50199048
Trg + Lig
Ki
nM
ΔG°
kcal/mole
IC50
nM
Kd
nM
EC50/IC50
nM
koff
s-1
kon
M-1s-1
pHTemp
°C
Hepatitis C virus NS5B RNA-dependent RNA polymerase
(Hepatitis C virus)
BDBM50199048
(13-cyclohexyl-5-iso-propyl-6,7-dihydro-5H-benzo[5,...)
Show SMILES CC(C)N1CCn2c(c(C3CCCCC3)c3ccc(cc23)C(O)=O)-c2ccccc12
Show InChI InChI=1S/C26H30N2O2/c1-17(2)27-14-15-28-23-16-19(26(29)30)12-13-20(23)24(18-8-4-3-5-9-18)25(28)21-10-6-7-11-22(21)27/h6-7,10-13,16-18H,3-5,8-9,14-15H2,1-2H3,(H,29,30)
n/an/a 36n/an/an/an/an/an/a
Central Pharmaceutical Research Institute
Curated by ChEMBL
Assay Description
Inhibition of HCV NS5B RNA polymerase
J Med Chem 49: 6950-3 (2006)
Article DOI: 10.1021/jm0610245
BindingDB Entry DOI: 10.7270/Q2XD12GM