BDBM50199082 CHEMBL3891289
SMILES: CC1CCN(CC1)C(=O)C(CCc1ccccc1Cl)NS(=O)(=O)c1cc(Cl)c(N)c(Cl)c1
InChI Key: InChIKey=UQZIJONPFBRSEK-UHFFFAOYSA-N
Data: 1 IC50
Activity Spreadsheet -- Enzyme Inhibition Constant Data from BindingDB
Found 1 hit for monomerid = 50199082
Trg + Lig
Ki
nM
ΔG°
kcal/mole
IC50
nM
Kd
nM
EC50/IC50
nM
koff
s-1
kon
M-1s-1
pHTemp
°C
C-C chemokine receptor type 10
(Homo sapiens (Human))
BDBM50199082
(CHEMBL3891289)
Show SMILES CC1CCN(CC1)C(=O)C(CCc1ccccc1Cl)NS(=O)(=O)c1cc(Cl)c(N)c(Cl)c1
Show InChI InChI=1S/C22H26Cl3N3O3S/c1-14-8-10-28(11-9-14)22(29)20(7-6-15-4-2-3-5-17(15)23)27-32(30,31)16-12-18(24)21(26)19(25)13-16/h2-5,12-14,20,27H,6-11,26H2,1H3
n/an/a 126n/an/an/an/an/an/a
Boehringer Ingelheim Pharmaceuticals
Curated by ChEMBL
Assay Description
Antagonist activity at human CCR10 expressed in CHOK1 cells coexpressing aequorin/Galphaq assessed as inhibition of human CCL27-dependent calcium flu...
Bioorg Med Chem Lett 26: 5277-5283 (2016)
Article DOI: 10.1016/j.bmcl.2016.09.047
BindingDB Entry DOI: 10.7270/Q2KD20WF