BDBM50199219 6-(4-chlorophenyl)-3-[2-(1-pyrrolidinylmethyl)-6-quinolinyl]-thieno[3,2-d]pyrimidin-4(3H)-one::CHEMBL215235
SMILES: Clc1ccc(cc1)-c1cc2ncn(-c3ccc4nc(CN5CCCC5)ccc4c3)c(=O)c2s1
InChI Key: InChIKey=QOKPEQZKMJABFG-UHFFFAOYSA-N
Data: 1 IC50
Activity Spreadsheet -- Enzyme Inhibition Constant Data from BindingDB
Found 1 hit for monomerid = 50199219
Trg + Lig
Ki
nM
ΔG°
kcal/mole
IC50
nM
Kd
nM
EC50/IC50
nM
koff
s-1
kon
M-1s-1
pHTemp
°C
Melanin-concentrating hormone receptor
(Homo sapiens (Human))
BDBM50199219
(6-(4-chlorophenyl)-3-[2-(1-pyrrolidinylmethyl)-6-q...)
Show SMILES Clc1ccc(cc1)-c1cc2ncn(-c3ccc4nc(CN5CCCC5)ccc4c3)c(=O)c2s1
Show InChI InChI=1S/C26H21ClN4OS/c27-19-6-3-17(4-7-19)24-14-23-25(33-24)26(32)31(16-28-23)21-9-10-22-18(13-21)5-8-20(29-22)15-30-11-1-2-12-30/h3-10,13-14,16H,1-2,11-12,15H2
Reactome pathway
n/an/a 1n/an/an/an/an/an/a
GlaxoSmithKline
Curated by ChEMBL
Assay Description
Antagonist activity against human MCHR1 expressed in CHO cells by Gal4/Elk1-Luc reporter assay
J Med Chem 49: 7095-107 (2006)
Article DOI: 10.1021/jm060572f
BindingDB Entry DOI: 10.7270/Q2P26XS8