null
SMILES: Clc1ccc(cc1)-c1cc2ncn(-c3ccc4C=C(CN5CCCCC5)CCc4c3)c(=O)c2s1
InChI Key: InChIKey=DMADJAYTJYCDGS-UHFFFAOYSA-N
Activity Spreadsheet -- Enzyme Inhibition Constant Data from BindingDB
Found 1 hit for monomerid = 50199251
Trg + Lig
Ki
nM
ΔG°
kcal/mole
IC50
nM
Kd
nM
EC50/IC50
nM
koff
s-1
kon
M-1s-1
pHTemp
°C
Melanin-concentrating hormone receptor 1
(Homo sapiens (Human))
BDBM50199251
(6-(4-chlorophenyl)-3-[6-(1-piperidinylmethyl)-7,8-...)
Show SMILES Clc1ccc(cc1)-c1cc2ncn(-c3ccc4C=C(CN5CCCCC5)CCc4c3)c(=O)c2s1 |t:18|
Show InChI InChI=1S/C28H26ClN3OS/c29-23-9-6-20(7-10-23)26-16-25-27(34-26)28(33)32(18-30-25)24-11-8-21-14-19(4-5-22(21)15-24)17-31-12-2-1-3-13-31/h6-11,14-16,18H,1-5,12-13,17H2
Reactome pathway
n/an/a 0.75n/an/an/an/an/an/a
GlaxoSmithKline
Curated by ChEMBL
Assay Description
Antagonist activity against human MCH1 receptor stably-expressed in CHO cells by Gal4/Elk1-Luc reporter assay
J Med Chem 49: 7108-18 (2006)
Article DOI: 10.1021/jm060814b
BindingDB Entry DOI: 10.7270/Q2JD4WFT