BDBM50199484 CHEMBL3924676
SMILES: CCCSCCNCCNC(=O)\C=C\c1ccccc1
InChI Key: InChIKey=UBEVHISYPCOBAY-CMDGGOBGSA-N
Data: 1 KI  1 IC50
Activity Spreadsheet -- Enzyme Inhibition Constant Data from BindingDB
Found 2 hits for monomerid = 50199484
Trg + Lig
Ki
nM
ΔG°
kcal/mole
IC50
nM
Kd
nM
EC50/IC50
nM
koff
s-1
kon
M-1s-1
pHTemp
°C
Shiga toxin subunit A
(Shigella dysenteriae)
BDBM50199484
(CHEMBL3924676)
Show SMILES CCCSCCNCCNC(=O)\C=C\c1ccccc1
Show InChI InChI=1S/C16H24N2OS/c1-2-13-20-14-12-17-10-11-18-16(19)9-8-15-6-4-3-5-7-15/h3-9,17H,2,10-14H2,1H3,(H,18,19)/b9-8+
1.89E+5n/an/an/an/an/an/an/an/a
TBA
Curated by ChEMBL
Assay Description
Inhibition of Shigella dysenteriae type 1 Shiga toxin A subunit assessed as change in transition temperature by SYPRO orange dye based fluorescence-b...
J Med Chem 59: 10763-10773 (2016)
Article DOI: 10.1021/acs.jmedchem.6b01517
BindingDB Entry DOI: 10.7270/Q2571DZG
Shiga toxin subunit A
(Shigella dysenteriae)
BDBM50199484
(CHEMBL3924676)
Show SMILES CCCSCCNCCNC(=O)\C=C\c1ccccc1
Show InChI InChI=1S/C16H24N2OS/c1-2-13-20-14-12-17-10-11-18-16(19)9-8-15-6-4-3-5-7-15/h3-9,17H,2,10-14H2,1H3,(H,18,19)/b9-8+
n/an/a 8.20E+3n/an/an/an/an/an/a
TBA
Curated by ChEMBL
Assay Description
Inhibition of Shigella dysenteriae type 1 Shiga toxin A subunit in African green monkey Vero cells assessed as inhibition of Stx-induced cytotoxicity...
J Med Chem 59: 10763-10773 (2016)
Article DOI: 10.1021/acs.jmedchem.6b01517
BindingDB Entry DOI: 10.7270/Q2571DZG