BDBM50199712 CHEMBL3958944
SMILES: CCn1nc(cc(NC(=O)Nc2c(Cl)cncc2Cl)c1=O)-c1cccc(c1)-c1cccc(c1)C(N)=O
InChI Key: InChIKey=WEDIKYZYDMUUAW-UHFFFAOYSA-N
Data: 1 IC50
Activity Spreadsheet -- Enzyme Inhibition Constant Data from BindingDB
Found 1 hit for monomerid = 50199712
Trg + Lig
Ki
nM
ΔG°
kcal/mole
IC50
nM
Kd
nM
EC50/IC50
nM
koff
s-1
kon
M-1s-1
pHTemp
°C
cAMP-specific 3',5'-cyclic phosphodiesterase 4B
(Homo sapiens (Human))
BDBM50199712
(CHEMBL3958944)
Show SMILES CCn1nc(cc(NC(=O)Nc2c(Cl)cncc2Cl)c1=O)-c1cccc(c1)-c1cccc(c1)C(N)=O
Show InChI InChI=1S/C25H20Cl2N6O3/c1-2-33-24(35)21(30-25(36)31-22-18(26)12-29-13-19(22)27)11-20(32-33)16-7-3-5-14(9-16)15-6-4-8-17(10-15)23(28)34/h3-13H,2H2,1H3,(H2,28,34)(H2,29,30,31,36)
n/an/a 0.0500n/an/an/an/an/an/a
Rhône-Poulenc Rorer
Curated by ChEMBL
Assay Description
Inhibition of human recombinant PDE4B1 assessed as reduction in [3H]cAMP hydrolysis to [3H]AMP incubated for 60 mins by PDE-SPA assay
J Med Chem 59: 10479-10497 (2016)
Article DOI: 10.1021/acs.jmedchem.6b00829
BindingDB Entry DOI: 10.7270/Q21G0P75