BDBM50199726 CHEMBL3941862
SMILES: CCNC(=O)c1cc(cc(c1)-c1cccc(c1)-c1cc(NC(=O)Nc2c(Cl)cncc2Cl)c(=O)n(CC)n1)C(=O)NCCCN(C)C
InChI Key: InChIKey=ODTQXVXYPYSPSO-UHFFFAOYSA-N
Data: 4 IC50
Activity Spreadsheet -- Enzyme Inhibition Constant Data from BindingDB
Found 4 hits for monomerid = 50199726
Trg + Lig
Ki
nM
ΔG°
kcal/mole
IC50
nM
Kd
nM
EC50/IC50
nM
koff
s-1
kon
M-1s-1
pHTemp
°C
Adenosine receptor A2a
(Homo sapiens (Human))
BDBM50199726
(CHEMBL3941862)
Show SMILES CCNC(=O)c1cc(cc(c1)-c1cccc(c1)-c1cc(NC(=O)Nc2c(Cl)cncc2Cl)c(=O)n(CC)n1)C(=O)NCCCN(C)C
Show InChI InChI=1S/C33H36Cl2N8O4/c1-5-37-30(44)23-14-22(15-24(16-23)31(45)38-11-8-12-42(3)4)20-9-7-10-21(13-20)27-17-28(32(46)43(6-2)41-27)39-33(47)40-29-25(34)18-36-19-26(29)35/h7,9-10,13-19H,5-6,8,11-12H2,1-4H3,(H,37,44)(H,38,45)(H2,36,39,40,47)
NCI pathway
Reactome pathway
n/an/a>1.00E+3n/an/an/an/an/an/a
Rhône-Poulenc Rorer
Curated by ChEMBL
Assay Description
Antagonist activity at adenosine A2a receptor (unknown origin)
J Med Chem 59: 10479-10497 (2016)
Article DOI: 10.1021/acs.jmedchem.6b00829
BindingDB Entry DOI: 10.7270/Q21G0P75
Adenosine receptor A1
(Homo sapiens (Human))
BDBM50199726
(CHEMBL3941862)
Show SMILES CCNC(=O)c1cc(cc(c1)-c1cccc(c1)-c1cc(NC(=O)Nc2c(Cl)cncc2Cl)c(=O)n(CC)n1)C(=O)NCCCN(C)C
Show InChI InChI=1S/C33H36Cl2N8O4/c1-5-37-30(44)23-14-22(15-24(16-23)31(45)38-11-8-12-42(3)4)20-9-7-10-21(13-20)27-17-28(32(46)43(6-2)41-27)39-33(47)40-29-25(34)18-36-19-26(29)35/h7,9-10,13-19H,5-6,8,11-12H2,1-4H3,(H,37,44)(H,38,45)(H2,36,39,40,47)
Reactome pathway
n/an/a 537n/an/an/an/an/an/a
Rhône-Poulenc Rorer
Curated by ChEMBL
Assay Description
Antagonist activity at adenosine A1 receptor (unknown origin)
J Med Chem 59: 10479-10497 (2016)
Article DOI: 10.1021/acs.jmedchem.6b00829
BindingDB Entry DOI: 10.7270/Q21G0P75
Adenosine receptor A2b
(Homo sapiens (Human))
BDBM50199726
(CHEMBL3941862)
Show SMILES CCNC(=O)c1cc(cc(c1)-c1cccc(c1)-c1cc(NC(=O)Nc2c(Cl)cncc2Cl)c(=O)n(CC)n1)C(=O)NCCCN(C)C
Show InChI InChI=1S/C33H36Cl2N8O4/c1-5-37-30(44)23-14-22(15-24(16-23)31(45)38-11-8-12-42(3)4)20-9-7-10-21(13-20)27-17-28(32(46)43(6-2)41-27)39-33(47)40-29-25(34)18-36-19-26(29)35/h7,9-10,13-19H,5-6,8,11-12H2,1-4H3,(H,37,44)(H,38,45)(H2,36,39,40,47)
NCI pathway
Reactome pathway
n/an/a 368n/an/an/an/an/an/a
Rhône-Poulenc Rorer
Curated by ChEMBL
Assay Description
Antagonist activity at adenosine A2b receptor (unknown origin)
J Med Chem 59: 10479-10497 (2016)
Article DOI: 10.1021/acs.jmedchem.6b00829
BindingDB Entry DOI: 10.7270/Q21G0P75
cAMP-specific 3',5'-cyclic phosphodiesterase 4B
(Homo sapiens (Human))
BDBM50199726
(CHEMBL3941862)
Show SMILES CCNC(=O)c1cc(cc(c1)-c1cccc(c1)-c1cc(NC(=O)Nc2c(Cl)cncc2Cl)c(=O)n(CC)n1)C(=O)NCCCN(C)C
Show InChI InChI=1S/C33H36Cl2N8O4/c1-5-37-30(44)23-14-22(15-24(16-23)31(45)38-11-8-12-42(3)4)20-9-7-10-21(13-20)27-17-28(32(46)43(6-2)41-27)39-33(47)40-29-25(34)18-36-19-26(29)35/h7,9-10,13-19H,5-6,8,11-12H2,1-4H3,(H,37,44)(H,38,45)(H2,36,39,40,47)
n/an/a 0.0500n/an/an/an/an/an/a
Rhône-Poulenc Rorer
Curated by ChEMBL
Assay Description
Inhibition of human recombinant PDE4B1 assessed as reduction in [3H]cAMP hydrolysis to [3H]AMP incubated for 60 mins by PDE-SPA assay
J Med Chem 59: 10479-10497 (2016)
Article DOI: 10.1021/acs.jmedchem.6b00829
BindingDB Entry DOI: 10.7270/Q21G0P75