BDBM50199749 CHEMBL268772::N-((S,Z)-1-(2-((3S)-2-hydroxy-5-oxo-tetrahydrofuran-3-ylamino)-2-oxoethyl)-6-((4-methoxybenz-amido)methyl)-2-oxo-2,3,4,7-tetrahydro-1H-azepin-3-yl)-2-naphthamide
SMILES: COc1ccc(cc1)C(=O)NCC1=CC[C@H](NC(=O)c2ccc3ccccc3c2)C(=O)N(CC(=O)N[C@H]2CC(=O)OC2O)C1
InChI Key: InChIKey=ZJOMIVVGRLRQHB-URFMBUMFSA-N
Data: 3 IC50
Activity Spreadsheet -- Enzyme Inhibition Constant Data from BindingDB
Found 3 hits for monomerid = 50199749
Trg + Lig
Ki
nM
ΔG°
kcal/mole
IC50
nM
Kd
nM
EC50/IC50
nM
koff
s-1
kon
M-1s-1
pHTemp
°C
Caspase-8
(Homo sapiens (Human))
BDBM50199749
(CHEMBL268772 | N-((S,Z)-1-(2-((3S)-2-hydroxy-5-oxo...)
Show SMILES COc1ccc(cc1)C(=O)NCC1=CC[C@H](NC(=O)c2ccc3ccccc3c2)C(=O)N(CC(=O)N[C@H]2CC(=O)OC2O)C1 |w:41.45,t:13|
Show InChI InChI=1S/C32H32N4O8/c1-43-24-11-9-21(10-12-24)29(39)33-16-19-6-13-25(35-30(40)23-8-7-20-4-2-3-5-22(20)14-23)31(41)36(17-19)18-27(37)34-26-15-28(38)44-32(26)42/h2-12,14,25-26,32,42H,13,15-18H2,1H3,(H,33,39)(H,34,37)(H,35,40)/t25-,26-,32?/m0/s1
NCI pathway
Reactome pathway
n/an/a 471n/an/an/an/an/an/a
Procter & Gamble Pharmaceuticals, Inc.
Curated by ChEMBL
Assay Description
Inhibition of caspase 8
Bioorg Med Chem 15: 1311-22 (2007)
Article DOI: 10.1016/j.bmc.2006.11.011
BindingDB Entry DOI: 10.7270/Q2GF0T5M
Caspase-3
(Homo sapiens (Human))
BDBM50199749
(CHEMBL268772 | N-((S,Z)-1-(2-((3S)-2-hydroxy-5-oxo...)
Show SMILES COc1ccc(cc1)C(=O)NCC1=CC[C@H](NC(=O)c2ccc3ccccc3c2)C(=O)N(CC(=O)N[C@H]2CC(=O)OC2O)C1 |w:41.45,t:13|
Show InChI InChI=1S/C32H32N4O8/c1-43-24-11-9-21(10-12-24)29(39)33-16-19-6-13-25(35-30(40)23-8-7-20-4-2-3-5-22(20)14-23)31(41)36(17-19)18-27(37)34-26-15-28(38)44-32(26)42/h2-12,14,25-26,32,42H,13,15-18H2,1H3,(H,33,39)(H,34,37)(H,35,40)/t25-,26-,32?/m0/s1
NCI pathway
Reactome pathway
n/an/a 1.13E+3n/an/an/an/an/an/a
Procter & Gamble Pharmaceuticals, Inc.
Curated by ChEMBL
Assay Description
Inhibition of caspase 3
Bioorg Med Chem 15: 1311-22 (2007)
Article DOI: 10.1016/j.bmc.2006.11.011
BindingDB Entry DOI: 10.7270/Q2GF0T5M
Caspase-1
(Homo sapiens (Human))
BDBM50199749
(CHEMBL268772 | N-((S,Z)-1-(2-((3S)-2-hydroxy-5-oxo...)
Show SMILES COc1ccc(cc1)C(=O)NCC1=CC[C@H](NC(=O)c2ccc3ccccc3c2)C(=O)N(CC(=O)N[C@H]2CC(=O)OC2O)C1 |w:41.45,t:13|
Show InChI InChI=1S/C32H32N4O8/c1-43-24-11-9-21(10-12-24)29(39)33-16-19-6-13-25(35-30(40)23-8-7-20-4-2-3-5-22(20)14-23)31(41)36(17-19)18-27(37)34-26-15-28(38)44-32(26)42/h2-12,14,25-26,32,42H,13,15-18H2,1H3,(H,33,39)(H,34,37)(H,35,40)/t25-,26-,32?/m0/s1
NCI pathway
Reactome pathway
n/an/a 1n/an/an/an/an/an/a
Procter & Gamble Pharmaceuticals, Inc.
Curated by ChEMBL
Assay Description
Inhibition of ICE
Bioorg Med Chem 15: 1311-22 (2007)
Article DOI: 10.1016/j.bmc.2006.11.011
BindingDB Entry DOI: 10.7270/Q2GF0T5M