BDBM50199964 CHEMBL3924835
SMILES: Cl.CN(C)S(=O)(=O)c1cccc(c1)-c1c(C)nc2c(NCc3ccccn3)cc(Cl)nn12
InChI Key: InChIKey=ICVAJKLVLRZMFI-UHFFFAOYSA-N
Data: 1 IC50
Activity Spreadsheet -- Enzyme Inhibition Constant Data from BindingDB
Found 1 hit for monomerid = 50199964
Trg + Lig
Ki
nM
ΔG°
kcal/mole
IC50
nM
Kd
nM
EC50/IC50
nM
koff
s-1
kon
M-1s-1
pHTemp
°C
Phosphatidylinositol 4-kinase beta
(Homo sapiens (Human))
BDBM50199964
(CHEMBL3924835)
Show SMILES Cl.CN(C)S(=O)(=O)c1cccc(c1)-c1c(C)nc2c(NCc3ccccn3)cc(Cl)nn12
Show InChI InChI=1S/C21H21ClN6O2S/c1-14-20(15-7-6-9-17(11-15)31(29,30)27(2)3)28-21(25-14)18(12-19(22)26-28)24-13-16-8-4-5-10-23-16/h4-12,24H,13H2,1-3H3
n/an/a 145n/an/an/an/an/an/a
Academy of Sciences of the Czech Republic
Curated by ChEMBL
Assay Description
Inhibition of PI4KB (unknown origin) by ADP-Glo kinase assay
J Med Chem 60: 100-118 (2017)
Article DOI: 10.1021/acs.jmedchem.6b01465
BindingDB Entry DOI: 10.7270/Q28054K8