null
SMILES: COc1ccc(cc1S(=O)(=O)NCC=C)-c1c(C)nc2c(NCCNC(C)=O)cc(Cl)nn12
InChI Key: InChIKey=GRHQJOYUBHIACN-UHFFFAOYSA-N
Activity Spreadsheet -- Enzyme Inhibition Constant Data from BindingDB
Found 1 hit for monomerid = 50200096
Trg + Lig
Ki
nM
ΔG°
kcal/mole
IC50
nM
Kd
nM
EC50/IC50
nM
koff
s-1
kon
M-1s-1
pHTemp
°C
Phosphatidylinositol 4-kinase beta
(Homo sapiens (Human))
BDBM50200096
(CHEMBL3893537)
Show SMILES COc1ccc(cc1S(=O)(=O)NCC=C)-c1c(C)nc2c(NCCNC(C)=O)cc(Cl)nn12
Show InChI InChI=1S/C21H25ClN6O4S/c1-5-8-25-33(30,31)18-11-15(6-7-17(18)32-4)20-13(2)26-21-16(12-19(22)27-28(20)21)24-10-9-23-14(3)29/h5-7,11-12,24-25H,1,8-10H2,2-4H3,(H,23,29)
n/an/a 20n/an/an/an/an/an/a
Academy of Sciences of the Czech Republic
Curated by ChEMBL
Assay Description
Inhibition of PI4KB (unknown origin) by ADP-Glo kinase assay
J Med Chem 60: 100-118 (2017)
Article DOI: 10.1021/acs.jmedchem.6b01465
BindingDB Entry DOI: 10.7270/Q28054K8