BDBM50200343 (-)-(7S,11S)-huprine H7
SMILES: CCC1=C[C@H]2C[C@@H](C1)c1c(C2)[nH+]c2cc(Cl)ccc2c1N
InChI Key: InChIKey=QTPHSDHUHXUYFE-UHFFFAOYSA-O
Data: 1 IC50
Activity Spreadsheet -- Enzyme Inhibition Constant Data from BindingDB
Found 1 hit for monomerid = 50200343
Trg + Lig
Ki
nM
ΔG°
kcal/mole
IC50
nM
Kd
nM
EC50/IC50
nM
koff
s-1
kon
M-1s-1
pHTemp
°C
Acetylcholinesterase
(Bos taurus (bovine))
BDBM50200343
((-)-(7S,11S)-huprine H7)
Show SMILES CCC1=C[C@H]2C[C@@H](C1)c1c(C2)[nH+]c2cc(Cl)ccc2c1N |t:2|
Show InChI InChI=1S/C18H19ClN2/c1-2-10-5-11-7-12(6-10)17-16(8-11)21-15-9-13(19)3-4-14(15)18(17)20/h3-5,9,11-12H,2,6-8H2,1H3,(H2,20,21)/p+1
Reactome pathway
n/an/a 1.30n/an/an/an/an/an/a
Universitat de Barcelona
Curated by ChEMBL
Assay Description
Inhibition of bovine erythrocyte AChE
J Med Chem 49: 6833-40 (2006)
Article DOI: 10.1021/jm060945c
BindingDB Entry DOI: 10.7270/Q29K4C1S