BDBM50200468 CHEMBL3919787
SMILES: CC(C)C[C@H](NC(=O)[C@H](CCC(O)=O)NC(=O)CNC(=O)[C@@H](NC(=O)[C@H](CCC(O)=O)NC(=O)[C@@H]1CCCN1C(=O)[C@H](CC(N)=O)NC(C)=O)[C@@H](C)O)C(O)=O
InChI Key: InChIKey=YHBYNIAFTHBNFW-UBCURMOZSA-N
Data: 1 IC50
Activity Spreadsheet -- Enzyme Inhibition Constant Data from BindingDB
Found 1 hit for monomerid = 50200468
Trg + Lig
Ki
nM
ΔG°
kcal/mole
IC50
nM
Kd
nM
EC50/IC50
nM
koff
s-1
kon
M-1s-1
pHTemp
°C
Nuclear factor erythroid 2-related factor 2
(Homo sapiens (Human))
BDBM50200468
(CHEMBL3919787)
Show SMILES CC(C)C[C@H](NC(=O)[C@H](CCC(O)=O)NC(=O)CNC(=O)[C@@H](NC(=O)[C@H](CCC(O)=O)NC(=O)[C@@H]1CCCN1C(=O)[C@H](CC(N)=O)NC(C)=O)[C@@H](C)O)C(O)=O |r|
Show InChI InChI=1S/C33H52N8O15/c1-15(2)12-21(33(55)56)39-28(50)18(7-9-25(46)47)37-24(45)14-35-31(53)27(16(3)42)40-29(51)19(8-10-26(48)49)38-30(52)22-6-5-11-41(22)32(54)20(13-23(34)44)36-17(4)43/h15-16,18-22,27,42H,5-14H2,1-4H3,(H2,34,44)(H,35,53)(H,36,43)(H,37,45)(H,38,52)(H,39,50)(H,40,51)(H,46,47)(H,48,49)(H,55,56)/t16-,18+,19+,20+,21+,22+,27+/m1/s1
n/an/a 875n/an/an/an/an/an/a
China Pharmaceutical University
Curated by ChEMBL
Assay Description
Inhibition of Keap1/Nrf2 (unknown origin) interaction assessed as displacement of FITC-betaAla-DEETGEF-OH from Keap1 Kelch domain after 1 hr by FITC-...
J Med Chem 59: 10837-10858 (2016)
Article DOI: 10.1021/acs.jmedchem.6b00586
BindingDB Entry DOI: 10.7270/Q2377BPQ