BDBM50200539 CHEMBL3925858
SMILES: CCc1cc2C(=O)c3c([nH]c4cc(ccc34)C#N)C(C)(C)c2cc1N1CCN(CC2(O)CCNCC2)CC1
InChI Key: InChIKey=BTNNIEZIMHCWOV-UHFFFAOYSA-N
Data: 1 IC50
Activity Spreadsheet -- Enzyme Inhibition Constant Data from BindingDB
Found 1 hit for monomerid = 50200539
Trg + Lig
Ki
nM
ΔG°
kcal/mole
IC50
nM
Kd
nM
EC50/IC50
nM
koff
s-1
kon
M-1s-1
pHTemp
°C
ALK tyrosine kinase receptor
(Homo sapiens (Human))
BDBM50200539
(CHEMBL3925858)
Show SMILES CCc1cc2C(=O)c3c([nH]c4cc(ccc34)C#N)C(C)(C)c2cc1N1CCN(CC2(O)CCNCC2)CC1
Show InChI InChI=1S/C31H37N5O2/c1-4-21-16-23-24(17-26(21)36-13-11-35(12-14-36)19-31(38)7-9-33-10-8-31)30(2,3)29-27(28(23)37)22-6-5-20(18-32)15-25(22)34-29/h5-6,15-17,33-34,38H,4,7-14,19H2,1-3H3
n/an/a 1.40n/an/an/an/an/an/a
Ocean University of China
Curated by ChEMBL
Assay Description
Inhibition of recombinant wild type ALK (unknown origin) using poly (Glu,Tyr)4:1 as substrate after 60 mins by ELISA
Bioorg Med Chem Lett 26: 5399-5402 (2016)
Article DOI: 10.1016/j.bmcl.2016.10.039
BindingDB Entry DOI: 10.7270/Q22809JW