BDBM50200608 CHEMBL238818::N-cyclopropyl-2-(3-{1-[3-(5-methoxy-2-methylphenoxy)-4-methyl-pentyl]-piperidin-4-yl}-2-oxo-2,3-dihydro-benzimidazol-1-yl)-acetamide
SMILES: COc1ccc(C)c(OC(CCN2CCC(CC2)n2c3ccccc3n(CC(=O)NC3CC3)c2=O)C(C)C)c1
InChI Key: InChIKey=HIUQBKUHVJBHKF-UHFFFAOYSA-N
Data: 2 KI  1 IC50
Activity Spreadsheet -- Enzyme Inhibition Constant Data from BindingDB
Found 3 hits for monomerid = 50200608
Trg + Lig
Ki
nM
ΔG°
kcal/mole
IC50
nM
Kd
nM
EC50/IC50
nM
koff
s-1
kon
M-1s-1
pHTemp
°C
Nociceptin receptor
(Homo sapiens (Human))
BDBM50200608
(CHEMBL238818 | N-cyclopropyl-2-(3-{1-[3-(5-methoxy...)
Show SMILES COc1ccc(C)c(OC(CCN2CCC(CC2)n2c3ccccc3n(CC(=O)NC3CC3)c2=O)C(C)C)c1 |w:9.8|
Show InChI InChI=1S/C31H42N4O4/c1-21(2)28(39-29-19-25(38-4)12-9-22(29)3)15-18-33-16-13-24(14-17-33)35-27-8-6-5-7-26(27)34(31(35)37)20-30(36)32-23-10-11-23/h5-9,12,19,21,23-24,28H,10-11,13-18,20H2,1-4H3,(H,32,36)
Reactome pathway
3n/an/an/an/an/an/an/an/a
Organon Laboratories Ltd.
Curated by ChEMBL
Assay Description
Displacement of [3H]nociceptin from human NOP receptor expressed in CHO cells
Bioorg Med Chem 15: 1828-47 (2007)
Article DOI: 10.1016/j.bmc.2006.11.030
BindingDB Entry DOI: 10.7270/Q27S7NF2
Mu-type opioid receptor
(Homo sapiens (Human))
BDBM50200608
(CHEMBL238818 | N-cyclopropyl-2-(3-{1-[3-(5-methoxy...)
Show SMILES COc1ccc(C)c(OC(CCN2CCC(CC2)n2c3ccccc3n(CC(=O)NC3CC3)c2=O)C(C)C)c1 |w:9.8|
Show InChI InChI=1S/C31H42N4O4/c1-21(2)28(39-29-19-25(38-4)12-9-22(29)3)15-18-33-16-13-24(14-17-33)35-27-8-6-5-7-26(27)34(31(35)37)20-30(36)32-23-10-11-23/h5-9,12,19,21,23-24,28H,10-11,13-18,20H2,1-4H3,(H,32,36)
NCI pathway
Reactome pathway
119n/an/an/an/an/an/an/an/a
Organon Laboratories Ltd.
Curated by ChEMBL
Assay Description
Displacement of [3H]diprenorphine from human MOP receptor expressed in CHOK1 cells
Bioorg Med Chem 15: 1828-47 (2007)
Article DOI: 10.1016/j.bmc.2006.11.030
BindingDB Entry DOI: 10.7270/Q27S7NF2
Nociceptin receptor
(Homo sapiens (Human))
BDBM50200608
(CHEMBL238818 | N-cyclopropyl-2-(3-{1-[3-(5-methoxy...)
Show SMILES COc1ccc(C)c(OC(CCN2CCC(CC2)n2c3ccccc3n(CC(=O)NC3CC3)c2=O)C(C)C)c1 |w:9.8|
Show InChI InChI=1S/C31H42N4O4/c1-21(2)28(39-29-19-25(38-4)12-9-22(29)3)15-18-33-16-13-24(14-17-33)35-27-8-6-5-7-26(27)34(31(35)37)20-30(36)32-23-10-11-23/h5-9,12,19,21,23-24,28H,10-11,13-18,20H2,1-4H3,(H,32,36)
Reactome pathway
n/an/a 40n/an/an/an/an/an/a
Organon Laboratories Ltd.
Curated by ChEMBL
Assay Description
Agonist activity at human NOP receptor expressed in CHO cells assessed as inhibition of forskolin-stimulated cAMP production after 2 hrs
Bioorg Med Chem 15: 1828-47 (2007)
Article DOI: 10.1016/j.bmc.2006.11.030
BindingDB Entry DOI: 10.7270/Q27S7NF2