null
SMILES: C[C@@H]1CN(Cc2cccc(F)c2F)c2cnccc2[C@H](C)N1C(=O)NCc1ccccc1
InChI Key: InChIKey=REFLPTMVRZJXOJ-MSOLQXFVSA-N
Activity Spreadsheet -- Enzyme Inhibition Constant Data from BindingDB
Found 3 hits for monomerid = 50200852
Trg + Lig
Ki
nM
ΔG°
kcal/mole
IC50
nM
Kd
nM
EC50/IC50
nM
koff
s-1
kon
M-1s-1
pHTemp
°C
Voltage-dependent T-type calcium channel subunit alpha-1H
(Homo sapiens (Human))
BDBM50200852
(CHEMBL3942836)
Show SMILES C[C@@H]1CN(Cc2cccc(F)c2F)c2cnccc2[C@H](C)N1C(=O)NCc1ccccc1 |r|
Show InChI InChI=1S/C25H26F2N4O/c1-17-15-30(16-20-9-6-10-22(26)24(20)27)23-14-28-12-11-21(23)18(2)31(17)25(32)29-13-19-7-4-3-5-8-19/h3-12,14,17-18H,13,15-16H2,1-2H3,(H,29,32)/t17-,18+/m1/s1
n/an/a 72n/an/an/an/an/an/a
Actelion Pharmaceuticals Ltd.
Curated by ChEMBL
Assay Description
Channel blocking activity at recombinant human CaV 3.2 channel expressed in HEK293 cells assessed as inhibition of Ca2+ flux preincubated for 3 mins ...
J Med Chem 59: 10661-10675 (2016)
Article DOI: 10.1021/acs.jmedchem.6b01356
BindingDB Entry DOI: 10.7270/Q2RV0QN8
Voltage-dependent T-type calcium channel subunit alpha-1G
(Homo sapiens (Human))
BDBM50200852
(CHEMBL3942836)
Show SMILES C[C@@H]1CN(Cc2cccc(F)c2F)c2cnccc2[C@H](C)N1C(=O)NCc1ccccc1 |r|
Show InChI InChI=1S/C25H26F2N4O/c1-17-15-30(16-20-9-6-10-22(26)24(20)27)23-14-28-12-11-21(23)18(2)31(17)25(32)29-13-19-7-4-3-5-8-19/h3-12,14,17-18H,13,15-16H2,1-2H3,(H,29,32)/t17-,18+/m1/s1
NCI pathway
Reactome pathway
n/an/a 38n/an/an/an/an/an/a
Actelion Pharmaceuticals Ltd.
Curated by ChEMBL
Assay Description
Channel blocking activity at recombinant human CaV 3.1 channel expressed in HEK293 cells assessed as inhibition of Ca2+ flux preincubated for 3 mins ...
J Med Chem 59: 10661-10675 (2016)
Article DOI: 10.1021/acs.jmedchem.6b01356
BindingDB Entry DOI: 10.7270/Q2RV0QN8
Voltage-dependent T-type calcium channel subunit alpha-1I
(Homo sapiens (Human))
BDBM50200852
(CHEMBL3942836)
Show SMILES C[C@@H]1CN(Cc2cccc(F)c2F)c2cnccc2[C@H](C)N1C(=O)NCc1ccccc1 |r|
Show InChI InChI=1S/C25H26F2N4O/c1-17-15-30(16-20-9-6-10-22(26)24(20)27)23-14-28-12-11-21(23)18(2)31(17)25(32)29-13-19-7-4-3-5-8-19/h3-12,14,17-18H,13,15-16H2,1-2H3,(H,29,32)/t17-,18+/m1/s1
Reactome pathway
n/an/a 13n/an/an/an/an/an/a
Actelion Pharmaceuticals Ltd.
Curated by ChEMBL
Assay Description
Channel blocking activity at recombinant human CaV 3.3 channel expressed in HEK293 cells assessed as inhibition of Ca2+ flux preincubated for 3 mins ...
J Med Chem 59: 10661-10675 (2016)
Article DOI: 10.1021/acs.jmedchem.6b01356
BindingDB Entry DOI: 10.7270/Q2RV0QN8