null
SMILES: COc1ccc(CNC(=O)N2[C@H](C)CN(CCC(C)C)c3cnccc3[C@@H]2C)cc1
InChI Key: InChIKey=XQYOVNZLIOPUGU-MOPGFXCFSA-N
Activity Spreadsheet -- Enzyme Inhibition Constant Data from BindingDB
Found 3 hits for monomerid = 50200891
Trg + Lig
Ki
nM
ΔG°
kcal/mole
IC50
nM
Kd
nM
EC50/IC50
nM
koff
s-1
kon
M-1s-1
pHTemp
°C
Voltage-dependent T-type calcium channel subunit alpha-1I
(Homo sapiens (Human))
BDBM50200891
(CHEMBL3910085)
Show SMILES COc1ccc(CNC(=O)N2[C@H](C)CN(CCC(C)C)c3cnccc3[C@@H]2C)cc1 |r|
Show InChI InChI=1S/C24H34N4O2/c1-17(2)11-13-27-16-18(3)28(19(4)22-10-12-25-15-23(22)27)24(29)26-14-20-6-8-21(30-5)9-7-20/h6-10,12,15,17-19H,11,13-14,16H2,1-5H3,(H,26,29)/t18-,19+/m1/s1
Reactome pathway
n/an/a 25n/an/an/an/an/an/a
Actelion Pharmaceuticals Ltd.
Curated by ChEMBL
Assay Description
Channel blocking activity at recombinant human CaV 3.3 channel expressed in HEK293 cells assessed as inhibition of Ca2+ flux preincubated for 3 mins ...
J Med Chem 59: 10661-10675 (2016)
Article DOI: 10.1021/acs.jmedchem.6b01356
BindingDB Entry DOI: 10.7270/Q2RV0QN8
Voltage-dependent T-type calcium channel subunit alpha-1G
(Homo sapiens (Human))
BDBM50200891
(CHEMBL3910085)
Show SMILES COc1ccc(CNC(=O)N2[C@H](C)CN(CCC(C)C)c3cnccc3[C@@H]2C)cc1 |r|
Show InChI InChI=1S/C24H34N4O2/c1-17(2)11-13-27-16-18(3)28(19(4)22-10-12-25-15-23(22)27)24(29)26-14-20-6-8-21(30-5)9-7-20/h6-10,12,15,17-19H,11,13-14,16H2,1-5H3,(H,26,29)/t18-,19+/m1/s1
NCI pathway
Reactome pathway
n/an/a 76n/an/an/an/an/an/a
Actelion Pharmaceuticals Ltd.
Curated by ChEMBL
Assay Description
Channel blocking activity at recombinant human CaV 3.1 channel expressed in HEK293 cells assessed as inhibition of Ca2+ flux preincubated for 3 mins ...
J Med Chem 59: 10661-10675 (2016)
Article DOI: 10.1021/acs.jmedchem.6b01356
BindingDB Entry DOI: 10.7270/Q2RV0QN8
Voltage-dependent T-type calcium channel subunit alpha-1H
(Homo sapiens (Human))
BDBM50200891
(CHEMBL3910085)
Show SMILES COc1ccc(CNC(=O)N2[C@H](C)CN(CCC(C)C)c3cnccc3[C@@H]2C)cc1 |r|
Show InChI InChI=1S/C24H34N4O2/c1-17(2)11-13-27-16-18(3)28(19(4)22-10-12-25-15-23(22)27)24(29)26-14-20-6-8-21(30-5)9-7-20/h6-10,12,15,17-19H,11,13-14,16H2,1-5H3,(H,26,29)/t18-,19+/m1/s1
n/an/a 55n/an/an/an/an/an/a
Actelion Pharmaceuticals Ltd.
Curated by ChEMBL
Assay Description
Channel blocking activity at recombinant human CaV 3.2 channel expressed in HEK293 cells assessed as inhibition of Ca2+ flux preincubated for 3 mins ...
J Med Chem 59: 10661-10675 (2016)
Article DOI: 10.1021/acs.jmedchem.6b01356
BindingDB Entry DOI: 10.7270/Q2RV0QN8