BDBM50201045 CHEMBL3925379
SMILES: OC1CCCCCCCNc2ncc3c(cn(CCCC1)c3n2)-c1ccc(NC(=O)N2CCOCC2)cc1
InChI Key: InChIKey=RSCAIJXVGDMQRL-UHFFFAOYSA-N
Data: 4 IC50  1 EC50
Activity Spreadsheet -- Enzyme Inhibition Constant Data from BindingDB
Found 5 hits for monomerid = 50201045
Trg + Lig
Ki
nM
ΔG°
kcal/mole
IC50
nM
Kd
nM
EC50/IC50
nM
koff
s-1
kon
M-1s-1
pHTemp
°C
Tyrosine-protein kinase receptor TYRO3
(Homo sapiens (Human))
BDBM50201045
(CHEMBL3925379)
Show SMILES OC1CCCCCCCNc2ncc3c(cn(CCCC1)c3n2)-c1ccc(NC(=O)N2CCOCC2)cc1
Show InChI InChI=1S/C29H40N6O3/c36-24-8-4-2-1-3-6-14-30-28-31-20-25-26(21-35(27(25)33-28)15-7-5-9-24)22-10-12-23(13-11-22)32-29(37)34-16-18-38-19-17-34/h10-13,20-21,24,36H,1-9,14-19H2,(H,32,37)(H,30,31,33)
n/an/a 300n/an/an/an/an/an/a
University of North Carolina at Chapel Hill
Curated by ChEMBL
Assay Description
Inhibition of Tyro3 (unknown origin) by microfluidic capillary electrophoresis assay
ACS Med Chem Lett 7: 1044-1049 (2016)
Article DOI: 10.1021/acsmedchemlett.6b00221
BindingDB Entry DOI: 10.7270/Q208679K
Tyrosine-protein kinase Mer
(Homo sapiens (Human))
BDBM50201045
(CHEMBL3925379)
Show SMILES OC1CCCCCCCNc2ncc3c(cn(CCCC1)c3n2)-c1ccc(NC(=O)N2CCOCC2)cc1
Show InChI InChI=1S/C29H40N6O3/c36-24-8-4-2-1-3-6-14-30-28-31-20-25-26(21-35(27(25)33-28)15-7-5-9-24)22-10-12-23(13-11-22)32-29(37)34-16-18-38-19-17-34/h10-13,20-21,24,36H,1-9,14-19H2,(H,32,37)(H,30,31,33)
Reactome pathway
n/an/a 30n/an/an/an/an/an/a
University of North Carolina at Chapel Hill
Curated by ChEMBL
Assay Description
Inhibition of MerTK (unknown origin) by microfluidic capillary electrophoresis assay
ACS Med Chem Lett 7: 1044-1049 (2016)
Article DOI: 10.1021/acsmedchemlett.6b00221
BindingDB Entry DOI: 10.7270/Q208679K
Receptor-type tyrosine-protein kinase FLT3
(Homo sapiens (Human))
BDBM50201045
(CHEMBL3925379)
Show SMILES OC1CCCCCCCNc2ncc3c(cn(CCCC1)c3n2)-c1ccc(NC(=O)N2CCOCC2)cc1
Show InChI InChI=1S/C29H40N6O3/c36-24-8-4-2-1-3-6-14-30-28-31-20-25-26(21-35(27(25)33-28)15-7-5-9-24)22-10-12-23(13-11-22)32-29(37)34-16-18-38-19-17-34/h10-13,20-21,24,36H,1-9,14-19H2,(H,32,37)(H,30,31,33)
n/an/a 84n/an/an/an/an/an/a
University of North Carolina at Chapel Hill
Curated by ChEMBL
Assay Description
Inhibition of Flt3 (unknown origin) by microfluidic capillary electrophoresis assay
ACS Med Chem Lett 7: 1044-1049 (2016)
Article DOI: 10.1021/acsmedchemlett.6b00221
BindingDB Entry DOI: 10.7270/Q208679K
Tyrosine-protein kinase receptor UFO
(Homo sapiens (Human))
BDBM50201045
(CHEMBL3925379)
Show SMILES OC1CCCCCCCNc2ncc3c(cn(CCCC1)c3n2)-c1ccc(NC(=O)N2CCOCC2)cc1
Show InChI InChI=1S/C29H40N6O3/c36-24-8-4-2-1-3-6-14-30-28-31-20-25-26(21-35(27(25)33-28)15-7-5-9-24)22-10-12-23(13-11-22)32-29(37)34-16-18-38-19-17-34/h10-13,20-21,24,36H,1-9,14-19H2,(H,32,37)(H,30,31,33)
n/an/a 180n/an/an/an/an/an/a
University of North Carolina at Chapel Hill
Curated by ChEMBL
Assay Description
Inhibition of Axl (unknown origin) by microfluidic capillary electrophoresis assay
ACS Med Chem Lett 7: 1044-1049 (2016)
Article DOI: 10.1021/acsmedchemlett.6b00221
BindingDB Entry DOI: 10.7270/Q208679K
Tyrosine-protein kinase Mer
(Homo sapiens (Human))
BDBM50201045
(CHEMBL3925379)
Show SMILES OC1CCCCCCCNc2ncc3c(cn(CCCC1)c3n2)-c1ccc(NC(=O)N2CCOCC2)cc1
Show InChI InChI=1S/C29H40N6O3/c36-24-8-4-2-1-3-6-14-30-28-31-20-25-26(21-35(27(25)33-28)15-7-5-9-24)22-10-12-23(13-11-22)32-29(37)34-16-18-38-19-17-34/h10-13,20-21,24,36H,1-9,14-19H2,(H,32,37)(H,30,31,33)
Reactome pathway
n/an/an/an/a 490n/an/an/an/a
University of North Carolina at Chapel Hill
Curated by ChEMBL
Assay Description
Inhibition of human MerTK kinase domain (1585 to 3000 residues) expressed in HEK293 cells co-expressing rat EGFR LBD assessed as inhibition of EGF-st...
ACS Med Chem Lett 7: 1044-1049 (2016)
Article DOI: 10.1021/acsmedchemlett.6b00221
BindingDB Entry DOI: 10.7270/Q208679K