null
SMILES: COc1ccc(F)cc1C(C)(C)CC(O)(Cn1ccc(=O)c2ncccc12)C(F)(F)F
InChI Key: InChIKey=AKVKAFLTKMIROA-UHFFFAOYSA-N
Activity Spreadsheet -- Enzyme Inhibition Constant Data from BindingDB
Found 3 hits for monomerid = 50201095
Trg + Lig
Ki
nM
ΔG°
kcal/mole
IC50
nM
Kd
nM
EC50/IC50
nM
koff
s-1
kon
M-1s-1
pHTemp
°C
Mineralocorticoid receptor
(Homo sapiens (Human))
BDBM50201095
(1-[4-(5-fluoro-2-methoxyphenyl)-2-hydroxy-4-methyl...)
Show SMILES COc1ccc(F)cc1C(C)(C)CC(O)(Cn1ccc(=O)c2ncccc12)C(F)(F)F
Show InChI InChI=1S/C22H22F4N2O3/c1-20(2,15-11-14(23)6-7-18(15)31-3)12-21(30,22(24,25)26)13-28-10-8-17(29)19-16(28)5-4-9-27-19/h4-11,30H,12-13H2,1-3H3
n/an/a 1.10E+3n/an/an/an/an/an/a
Boehringer Ingelheim Pharmaceuticals
Curated by ChEMBL
Assay Description
Inhibition of tetramethylrhodamine labeled dexamethosone binding to MR by FP assay
J Med Chem 49: 7887-96 (2006)
Article DOI: 10.1021/jm061273t
BindingDB Entry DOI: 10.7270/Q2BG2PTB
Progesterone receptor
(Homo sapiens (Human))
BDBM50201095
(1-[4-(5-fluoro-2-methoxyphenyl)-2-hydroxy-4-methyl...)
Show SMILES COc1ccc(F)cc1C(C)(C)CC(O)(Cn1ccc(=O)c2ncccc12)C(F)(F)F
Show InChI InChI=1S/C22H22F4N2O3/c1-20(2,15-11-14(23)6-7-18(15)31-3)12-21(30,22(24,25)26)13-28-10-8-17(29)19-16(28)5-4-9-27-19/h4-11,30H,12-13H2,1-3H3
n/an/a>2.00E+3n/an/an/an/an/an/a
Boehringer Ingelheim Pharmaceuticals
Curated by ChEMBL
Assay Description
Inhibition of tetramethylrhodamine labeled RU486 binding to PR by FP assay
J Med Chem 49: 7887-96 (2006)
Article DOI: 10.1021/jm061273t
BindingDB Entry DOI: 10.7270/Q2BG2PTB
Glucocorticoid receptor
(Homo sapiens (Human))
BDBM50201095
(1-[4-(5-fluoro-2-methoxyphenyl)-2-hydroxy-4-methyl...)
Show SMILES COc1ccc(F)cc1C(C)(C)CC(O)(Cn1ccc(=O)c2ncccc12)C(F)(F)F
Show InChI InChI=1S/C22H22F4N2O3/c1-20(2,15-11-14(23)6-7-18(15)31-3)12-21(30,22(24,25)26)13-28-10-8-17(29)19-16(28)5-4-9-27-19/h4-11,30H,12-13H2,1-3H3
n/an/a 77n/an/an/an/an/an/a
Boehringer Ingelheim Pharmaceuticals
Curated by ChEMBL
Assay Description
Inhibition of tetramethylrhodamine labeled dexamethosone binding to GR by FP assay
J Med Chem 49: 7887-96 (2006)
Article DOI: 10.1021/jm061273t
BindingDB Entry DOI: 10.7270/Q2BG2PTB