null
SMILES: COc1ccc(F)cc1C(C)(C)CC(O)(CN1CCOc2ccccc12)C(F)(F)F
InChI Key: InChIKey=IDCRMONFSJJBMN-UHFFFAOYSA-N
Activity Spreadsheet -- Enzyme Inhibition Constant Data from BindingDB
Found 3 hits for monomerid = 50201111
Trg + Lig
Ki
nM
ΔG°
kcal/mole
IC50
nM
Kd
nM
EC50/IC50
nM
koff
s-1
kon
M-1s-1
pHTemp
°C
Glucocorticoid receptor
(Homo sapiens (Human))
BDBM50201111
(2-[(2,3-dihydrobenzo[1,4]oxazin-4-yl)methyl]-1,1,1...)
Show SMILES COc1ccc(F)cc1C(C)(C)CC(O)(CN1CCOc2ccccc12)C(F)(F)F
Show InChI InChI=1S/C22H25F4NO3/c1-20(2,16-12-15(23)8-9-18(16)29-3)13-21(28,22(24,25)26)14-27-10-11-30-19-7-5-4-6-17(19)27/h4-9,12,28H,10-11,13-14H2,1-3H3
n/an/a 15n/an/an/an/an/an/a
Boehringer Ingelheim Pharmaceuticals
Curated by ChEMBL
Assay Description
Inhibition of tetramethylrhodamine labeled dexamethosone binding to GR by FP assay
J Med Chem 49: 7887-96 (2006)
Article DOI: 10.1021/jm061273t
BindingDB Entry DOI: 10.7270/Q2BG2PTB
Mineralocorticoid receptor
(Homo sapiens (Human))
BDBM50201111
(2-[(2,3-dihydrobenzo[1,4]oxazin-4-yl)methyl]-1,1,1...)
Show SMILES COc1ccc(F)cc1C(C)(C)CC(O)(CN1CCOc2ccccc12)C(F)(F)F
Show InChI InChI=1S/C22H25F4NO3/c1-20(2,16-12-15(23)8-9-18(16)29-3)13-21(28,22(24,25)26)14-27-10-11-30-19-7-5-4-6-17(19)27/h4-9,12,28H,10-11,13-14H2,1-3H3
n/an/a 310n/an/an/an/an/an/a
Boehringer Ingelheim Pharmaceuticals
Curated by ChEMBL
Assay Description
Inhibition of tetramethylrhodamine labeled dexamethosone binding to MR by FP assay
J Med Chem 49: 7887-96 (2006)
Article DOI: 10.1021/jm061273t
BindingDB Entry DOI: 10.7270/Q2BG2PTB
Progesterone receptor
(Homo sapiens (Human))
BDBM50201111
(2-[(2,3-dihydrobenzo[1,4]oxazin-4-yl)methyl]-1,1,1...)
Show SMILES COc1ccc(F)cc1C(C)(C)CC(O)(CN1CCOc2ccccc12)C(F)(F)F
Show InChI InChI=1S/C22H25F4NO3/c1-20(2,16-12-15(23)8-9-18(16)29-3)13-21(28,22(24,25)26)14-27-10-11-30-19-7-5-4-6-17(19)27/h4-9,12,28H,10-11,13-14H2,1-3H3
n/an/a 640n/an/an/an/an/an/a
Boehringer Ingelheim Pharmaceuticals
Curated by ChEMBL
Assay Description
Inhibition of tetramethylrhodamine labeled RU486 binding to PR by FP assay
J Med Chem 49: 7887-96 (2006)
Article DOI: 10.1021/jm061273t
BindingDB Entry DOI: 10.7270/Q2BG2PTB